%YAML 1.1
%TAG !u! tag:unity3d.com,2011:
--- !u!114 &11400000
MonoBehaviour:
  m_ObjectHideFlags: 0
  m_CorrespondingSourceObject: {fileID: 0}
  m_PrefabInstance: {fileID: 0}
  m_PrefabAsset: {fileID: 0}
  m_GameObject: {fileID: 0}
  m_Enabled: 1
  m_EditorHideFlags: 0
  m_Script: {fileID: 11500000, guid: 393f9732c756d1d4f96114f394d7c215, type: 3}
  m_Name: Mordomo
  m_EditorClassIdentifier: 
  characterName: B.42
  characterImg: {fileID: 21300000, guid: 9073585da06722b45a769065fb0846f5, type: 3}
