%YAML 1.1
%TAG !u! tag:unity3d.com,2011:
--- !u!114 &11400000
MonoBehaviour:
  m_ObjectHideFlags: 0
  m_CorrespondingSourceObject: {fileID: 0}
  m_PrefabInstance: {fileID: 0}
  m_PrefabAsset: {fileID: 0}
  m_GameObject: {fileID: 0}
  m_Enabled: 1
  m_EditorHideFlags: 0
  m_Script: {fileID: 11500000, guid: 71a274e7ecddd874fbc2e3d35fe22970, type: 3}
  m_Name: AkWwiseProjectData
  m_EditorClassIdentifier: 
  AcousticTextureWwu: []
  AuxBusWwu: []
  BankWwu: []
  EventWwu: []
  RtpcWwu: []
  StateWwu: []
  SwitchWwu: []
  TriggerWwu: []
  ExpandedItems: []
  autoPopulateEnabled: 1
  CurrentPluginConfig: 
