%YAML 1.1
%TAG !u! tag:unity3d.com,2011:
--- !u!21 &2100000
Material:
  serializedVersion: 6
  m_ObjectHideFlags: 0
  m_CorrespondingSourceObject: {fileID: 0}
  m_PrefabInstance: {fileID: 0}
  m_PrefabAsset: {fileID: 0}
  m_Name: ViewConeStripesFar
  m_Shader: {fileID: 4800000, guid: d8b63c30803527144ab14a538dd31d1e, type: 3}
  m_ShaderKeywords: 
  m_LightmapFlags: 4
  m_EnableInstancingVariants: 0
  m_DoubleSidedGI: 0
  m_CustomRenderQueue: -1
  stringTagMap: {}
  disabledShaderPasses: []
  m_SavedProperties:
    serializedVersion: 3
    m_TexEnvs:
    - StripeTex:
        m_Texture: {fileID: 0}
        m_Scale: {x: 1, y: 1}
        m_Offset: {x: 0, y: 0}
    - _MainTex:
        m_Texture: {fileID: 2800000, guid: d56e48ae75ff8014aaf942e2310ba44f, type: 3}
        m_Scale: {x: 1, y: 1}
        m_Offset: {x: 0, y: 0}
    - _StripeTex:
        m_Texture: {fileID: 2800000, guid: bcba582f07bc2be498c9620d84b3e751, type: 3}
        m_Scale: {x: 1, y: 1}
        m_Offset: {x: 0, y: 0}
    - _Texture0:
        m_Texture: {fileID: 2800000, guid: d56e48ae75ff8014aaf942e2310ba44f, type: 3}
        m_Scale: {x: 100, y: 100}
        m_Offset: {x: 0, y: 0}
    - _TextureSample0:
        m_Texture: {fileID: 2800000, guid: bcba582f07bc2be498c9620d84b3e751, type: 3}
        m_Scale: {x: 1, y: 1}
        m_Offset: {x: 0, y: 0}
    - _texcoord:
        m_Texture: {fileID: 0}
        m_Scale: {x: 1, y: 1}
        m_Offset: {x: 0, y: 0}
    m_Floats:
    - _AlphaCutoff: 0.5
    - _AlphaThreshold: 0
    - _Float0: 2
    - _Opacity: 0.05
    - _Rotation: 40
    - _Size: 10
    - _Speed: 0
    - _TessEdgeLength: 16
    - _TessMax: 25
    - _TessMaxDisp: 25
    - _TessMin: 10
    - _TessPhongStrength: 0.5
    - _TessValue: 16
    - _Tile: 2
    - _ViewDir: 19.093313
    m_Colors:
    - _ColorTint: {r: 0.7647059, g: 0.5803922, b: 0.05490196, a: 0}
    - _EmissionColor: {r: 1, g: 1, b: 1, a: 1}
    - _EnemyPos: {r: 1.0462468, g: 1.7174249, b: 5.491208, a: 0}
    - _TilingOffset: {r: 1, g: 1, b: 20, a: 20}
    - _ViewDir: {r: 0.28807306, g: 0, b: 0.95760846, a: 0}
