%YAML 1.1
%TAG !u! tag:unity3d.com,2011:
--- !u!74 &7400000
AnimationClip:
  m_ObjectHideFlags: 0
  m_CorrespondingSourceObject: {fileID: 0}
  m_PrefabInstance: {fileID: 0}
  m_PrefabAsset: {fileID: 0}
  m_Name: Ship_MainMenu
  serializedVersion: 6
  m_Legacy: 0
  m_Compressed: 0
  m_UseHighQualityCurve: 1
  m_RotationCurves: []
  m_CompressedRotationCurves: []
  m_EulerCurves:
  - curve:
      serializedVersion: 2
      m_Curve:
      - serializedVersion: 3
        time: 0
        value: {x: 0, y: 0, z: 0}
        inSlope: {x: -1.2919028, y: -0.20154612, z: -4.7370296}
        outSlope: {x: -1.2919028, y: -0.20154612, z: -4.7370296}
        tangentMode: 0
        weightedMode: 0
        inWeight: {x: 0.33333334, y: 0.33333334, z: 0.33333334}
        outWeight: {x: 0.33333334, y: 0.33333334, z: 0.33333334}
      - serializedVersion: 3
        time: 1.1833333
        value: {x: -1.5287516, y: -0.23849623, z: -5.605485}
        inSlope: {x: -1.1727697, y: -0.3311758, z: -0.5244143}
        outSlope: {x: -1.1727697, y: -0.3311758, z: -0.5244143}
        tangentMode: 0
        weightedMode: 0
        inWeight: {x: 0.33333334, y: 0.33333334, z: 0.33333334}
        outWeight: {x: 0.33333334, y: 0.33333334, z: 0.33333334}
      - serializedVersion: 3
        time: 3.7666667
        value: {x: -4.250646, y: -1.4289104, z: 3.922368}
        inSlope: {x: 0.419899, y: -0.31361175, z: 0.66131365}
        outSlope: {x: 0.419899, y: -0.31361175, z: 0.66131365}
        tangentMode: 0
        weightedMode: 0
        inWeight: {x: 0.33333334, y: 0.33333334, z: 0.33333334}
        outWeight: {x: 0.33333334, y: 0.33333334, z: 0.33333334}
      - serializedVersion: 3
        time: 6.2
        value: {x: 0.3567108, y: -1.8338609, z: -1.8338609}
        inSlope: {x: -0.597819, y: -0.083209015, z: -1.1827868}
        outSlope: {x: -0.597819, y: -0.083209015, z: -1.1827868}
        tangentMode: 0
        weightedMode: 0
        inWeight: {x: 0.33333334, y: 0.33333334, z: 0.33333334}
        outWeight: {x: 0.33333334, y: 0.33333334, z: 0.33333334}
      - serializedVersion: 3
        time: 7.866667
        value: {x: -4.791744, y: -1.8338609, z: -1.8338609}
        inSlope: {x: 2.5626755, y: 1.5718817, z: 1.7747049}
        outSlope: {x: 2.5626755, y: 1.5718817, z: 1.7747049}
        tangentMode: 0
        weightedMode: 0
        inWeight: {x: 0.33333334, y: 0.33333334, z: 0.33333334}
        outWeight: {x: 0.33333334, y: 0.33333334, z: 0.33333334}
      - serializedVersion: 3
        time: 8.383333
        value: {x: -0.37096274, y: -0.13798311, z: 0}
        inSlope: {x: 6.894229, y: 2.5265586, z: 4.164564}
        outSlope: {x: 6.894229, y: 2.5265586, z: 4.164564}
        tangentMode: 0
        weightedMode: 0
        inWeight: {x: 0.33333334, y: 0.33333334, z: 0.33333334}
        outWeight: {x: 0.33333334, y: 0.33333334, z: 0.8724058}
      - serializedVersion: 3
        time: 8.45
        value: {x: 0, y: 0, z: 0.25117305}
        inSlope: {x: 4.1072116, y: 1.5718817, z: 3.3706706}
        outSlope: {x: 4.1072116, y: 1.5718817, z: 3.3706706}
        tangentMode: 0
        weightedMode: 0
        inWeight: {x: 0.33333334, y: 0.33333334, z: 0.33333334}
        outWeight: {x: 0.33333334, y: 0.33333334, z: 0.33333334}
      - serializedVersion: 3
        time: 9.083333
        value: {x: 0, y: 0, z: 0}
        inSlope: {x: -1.5675005, y: -0.29118133, z: -4.1606216}
        outSlope: {x: -1.5675005, y: -0.29118133, z: -4.1606216}
        tangentMode: 0
        weightedMode: 0
        inWeight: {x: 0.8216423, y: 1, z: 0.5674946}
        outWeight: {x: 0.33333334, y: 0.33333334, z: 0.8724058}
      m_PreInfinity: 2
      m_PostInfinity: 2
      m_RotationOrder: 4
    path: 
  m_PositionCurves:
  - curve:
      serializedVersion: 2
      m_Curve:
      - serializedVersion: 3
        time: 0
        value: {x: 0, y: 0, z: 0}
        inSlope: {x: -0.50931674, y: -1.3870414, z: 0.10879557}
        outSlope: {x: -0.50931674, y: -1.3870414, z: 0.10879557}
        tangentMode: 0
        weightedMode: 0
        inWeight: {x: 0.33333334, y: 0.33333334, z: 0.33333334}
        outWeight: {x: 0.33333334, y: 0.33333334, z: 0.20536001}
      - serializedVersion: 3
        time: 1.75
        value: {x: -0.89130425, y: -2.4273226, z: -2.455543}
        inSlope: {x: -0.3213644, y: -0.13986039, z: -2.3859904}
        outSlope: {x: -0.3213644, y: -0.13986039, z: -2.3859904}
        tangentMode: 0
        weightedMode: 0
        inWeight: {x: 0.33333334, y: 0.33333334, z: 0.33333334}
        outWeight: {x: 0.33333334, y: 0.33333334, z: 0.33333334}
      - serializedVersion: 3
        time: 4.366667
        value: {x: -1.2403992, y: 0.47016653, z: -7.3783693}
        inSlope: {x: -0.1815696, y: -0.115251005, z: -0.19366112}
        outSlope: {x: -0.1815696, y: -0.115251005, z: -0.19366112}
        tangentMode: 0
        weightedMode: 0
        inWeight: {x: 0.33333334, y: 0.33333334, z: 0.33333334}
        outWeight: {x: 0.33333334, y: 0.33333334, z: 0.33333334}
      - serializedVersion: 3
        time: 4.9
        value: {x: -1.4101945, y: 0.021851182, z: -7.1433854}
        inSlope: {x: -0.42216, y: -1.4428906, z: 1.1239974}
        outSlope: {x: -0.42216, y: -1.4428906, z: 1.1239974}
        tangentMode: 0
        weightedMode: 0
        inWeight: {x: 0.33333334, y: 0.33333334, z: 0.33333334}
        outWeight: {x: 0.33333334, y: 0.33333334, z: 0.22481427}
      - serializedVersion: 3
        time: 6.45
        value: {x: -1.95137, y: -2.7627187, z: 2.3836768}
        inSlope: {x: 0.0026196972, y: -1.1108642, z: 0.090056196}
        outSlope: {x: 0.0026196972, y: -1.1108642, z: 0.090056196}
        tangentMode: 0
        weightedMode: 0
        inWeight: {x: 0.33333334, y: 0.33333334, z: 0.4042108}
        outWeight: {x: 0.33333334, y: 0.33333334, z: 0.33333334}
      - serializedVersion: 3
        time: 6.95
        value: {x: -1.8338609, y: -2.985875, z: 2.10228}
        inSlope: {x: 0.49642336, y: 0.3263803, z: -1.1048522}
        outSlope: {x: 0.49642336, y: 0.3263803, z: -1.1048522}
        tangentMode: 0
        weightedMode: 0
        inWeight: {x: 0.33333334, y: 0.33333334, z: 0.33333334}
        outWeight: {x: 0.33333334, y: 0.33333334, z: 0.33333334}
      - serializedVersion: 3
        time: 8.45
        value: {x: 0, y: 0, z: 0}
        inSlope: {x: 0.61128694, y: 1.0175775, z: -0.70105743}
        outSlope: {x: 0.61128694, y: 1.0175775, z: -0.70105743}
        tangentMode: 0
        weightedMode: 0
        inWeight: {x: 0.33333334, y: 0.33333334, z: 0.08709526}
        outWeight: {x: 0.33333334, y: 0.33333334, z: 1}
      - serializedVersion: 3
        time: 9.083333
        value: {x: 0, y: 0.02822876, z: 0}
        inSlope: {x: -0.79450274, y: -0.8924785, z: 0.15761039}
        outSlope: {x: -0.79450274, y: -0.8924785, z: 0.15761039}
        tangentMode: 0
        weightedMode: 0
        inWeight: {x: 0.9480016, y: 0.8938485, z: 0.875797}
        outWeight: {x: 0.33333334, y: 0.33333334, z: 1}
      m_PreInfinity: 2
      m_PostInfinity: 2
      m_RotationOrder: 4
    path: 
  m_ScaleCurves:
  - curve:
      serializedVersion: 2
      m_Curve:
      - serializedVersion: 3
        time: 0
        value: {x: 1, y: 1, z: 1}
        inSlope: {x: 0, y: 0, z: 0}
        outSlope: {x: 0, y: 0, z: 0}
        tangentMode: 0
        weightedMode: 0
        inWeight: {x: 0.33333334, y: 0.33333334, z: 0.33333334}
        outWeight: {x: 0.33333334, y: 0.33333334, z: 0.33333334}
      - serializedVersion: 3
        time: 8.45
        value: {x: 1, y: 1, z: 1}
        inSlope: {x: 0, y: 0, z: 0}
        outSlope: {x: 0, y: 0, z: 0}
        tangentMode: 0
        weightedMode: 0
        inWeight: {x: 0.33333334, y: 0.33333334, z: 0.33333334}
        outWeight: {x: 0.33333334, y: 0.33333334, z: 0.33333334}
      - serializedVersion: 3
        time: 9.083333
        value: {x: 1, y: 1, z: 1}
        inSlope: {x: 0, y: 0, z: 0}
        outSlope: {x: 0, y: 0, z: 0}
        tangentMode: 0
        weightedMode: 0
        inWeight: {x: 0.33333334, y: 0.33333334, z: 0.33333334}
        outWeight: {x: 0.33333334, y: 0.33333334, z: 0.33333334}
      m_PreInfinity: 2
      m_PostInfinity: 2
      m_RotationOrder: 4
    path: 
  m_FloatCurves: []
  m_PPtrCurves: []
  m_SampleRate: 60
  m_WrapMode: 0
  m_Bounds:
    m_Center: {x: 0, y: 0, z: 0}
    m_Extent: {x: 0, y: 0, z: 0}
  m_ClipBindingConstant:
    genericBindings:
    - serializedVersion: 2
      path: 0
      attribute: 1
      script: {fileID: 0}
      typeID: 4
      customType: 0
      isPPtrCurve: 0
    - serializedVersion: 2
      path: 0
      attribute: 4
      script: {fileID: 0}
      typeID: 4
      customType: 4
      isPPtrCurve: 0
    - serializedVersion: 2
      path: 0
      attribute: 3
      script: {fileID: 0}
      typeID: 4
      customType: 0
      isPPtrCurve: 0
    pptrCurveMapping: []
  m_AnimationClipSettings:
    serializedVersion: 2
    m_AdditiveReferencePoseClip: {fileID: 0}
    m_AdditiveReferencePoseTime: 0
    m_StartTime: 0
    m_StopTime: 9.083333
    m_OrientationOffsetY: 0
    m_Level: 0
    m_CycleOffset: 0
    m_HasAdditiveReferencePose: 0
    m_LoopTime: 1
    m_LoopBlend: 1
    m_LoopBlendOrientation: 0
    m_LoopBlendPositionY: 0
    m_LoopBlendPositionXZ: 0
    m_KeepOriginalOrientation: 0
    m_KeepOriginalPositionY: 1
    m_KeepOriginalPositionXZ: 0
    m_HeightFromFeet: 0
    m_Mirror: 0
  m_EditorCurves:
  - curve:
      serializedVersion: 2
      m_Curve:
      - serializedVersion: 3
        time: 0
        value: 0
        inSlope: -0.50931674
        outSlope: -0.50931674
        tangentMode: 34
        weightedMode: 0
        inWeight: 0.33333334
        outWeight: 0.33333334
      - serializedVersion: 3
        time: 1.75
        value: -0.89130425
        inSlope: -0.3213644
        outSlope: -0.3213644
        tangentMode: 34
        weightedMode: 0
        inWeight: 0.33333334
        outWeight: 0.33333334
      - serializedVersion: 3
        time: 4.366667
        value: -1.2403992
        inSlope: -0.1815696
        outSlope: -0.1815696
        tangentMode: 34
        weightedMode: 0
        inWeight: 0.33333334
        outWeight: 0.33333334
      - serializedVersion: 3
        time: 6.95
        value: -1.8338609
        inSlope: 0.49642336
        outSlope: 0.49642336
        tangentMode: 34
        weightedMode: 0
        inWeight: 0.33333334
        outWeight: 0.33333334
      - serializedVersion: 3
        time: 8.45
        value: 0
        inSlope: 0.61128694
        outSlope: 0.61128694
        tangentMode: 34
        weightedMode: 0
        inWeight: 0.33333334
        outWeight: 0.33333334
      - serializedVersion: 3
        time: 9.083333
        value: 0
        inSlope: -0.79450274
        outSlope: -0.79450274
        tangentMode: 0
        weightedMode: 0
        inWeight: 0.9480016
        outWeight: 0.33333334
      m_PreInfinity: 2
      m_PostInfinity: 2
      m_RotationOrder: 4
    attribute: m_LocalPosition.x
    path: 
    classID: 4
    script: {fileID: 0}
  - curve:
      serializedVersion: 2
      m_Curve:
      - serializedVersion: 3
        time: 0
        value: 0
        inSlope: -1.3870414
        outSlope: -1.3870414
        tangentMode: 34
        weightedMode: 0
        inWeight: 0.33333334
        outWeight: 0.33333334
      - serializedVersion: 3
        time: 1.75
        value: -2.4273226
        inSlope: -0.13986039
        outSlope: -0.13986039
        tangentMode: 34
        weightedMode: 0
        inWeight: 0.33333334
        outWeight: 0.33333334
      - serializedVersion: 3
        time: 4.366667
        value: 0.47016653
        inSlope: -0.115251005
        outSlope: -0.115251005
        tangentMode: 34
        weightedMode: 0
        inWeight: 0.33333334
        outWeight: 0.33333334
      - serializedVersion: 3
        time: 6.95
        value: -2.985875
        inSlope: 0.3263803
        outSlope: 0.3263803
        tangentMode: 34
        weightedMode: 0
        inWeight: 0.33333334
        outWeight: 0.33333334
      - serializedVersion: 3
        time: 8.45
        value: 0
        inSlope: 1.0175775
        outSlope: 1.0175775
        tangentMode: 34
        weightedMode: 0
        inWeight: 0.33333334
        outWeight: 0.33333334
      - serializedVersion: 3
        time: 9.083333
        value: 0.02822876
        inSlope: -0.8924785
        outSlope: -0.8924785
        tangentMode: 0
        weightedMode: 0
        inWeight: 0.8938485
        outWeight: 0.33333334
      m_PreInfinity: 2
      m_PostInfinity: 2
      m_RotationOrder: 4
    attribute: m_LocalPosition.y
    path: 
    classID: 4
    script: {fileID: 0}
  - curve:
      serializedVersion: 2
      m_Curve:
      - serializedVersion: 3
        time: 0
        value: 0
        inSlope: 0.10879557
        outSlope: 0.10879557
        tangentMode: 0
        weightedMode: 0
        inWeight: 0.33333334
        outWeight: 0.20536001
      - serializedVersion: 3
        time: 4.9
        value: -7.1433854
        inSlope: 1.1239974
        outSlope: 1.1239974
        tangentMode: 0
        weightedMode: 0
        inWeight: 0.33333334
        outWeight: 0.22481427
      - serializedVersion: 3
        time: 6.45
        value: 2.3836768
        inSlope: 0.090056196
        outSlope: 0.090056196
        tangentMode: 0
        weightedMode: 0
        inWeight: 0.4042108
        outWeight: 0.33333334
      - serializedVersion: 3
        time: 8.45
        value: 0
        inSlope: -0.70105743
        outSlope: -0.70105743
        tangentMode: 0
        weightedMode: 0
        inWeight: 0.08709526
        outWeight: 1
      - serializedVersion: 3
        time: 9.083333
        value: 0
        inSlope: 0.15761039
        outSlope: 0.15761039
        tangentMode: 0
        weightedMode: 0
        inWeight: 0.875797
        outWeight: 1
      m_PreInfinity: 2
      m_PostInfinity: 2
      m_RotationOrder: 4
    attribute: m_LocalPosition.z
    path: 
    classID: 4
    script: {fileID: 0}
  - curve:
      serializedVersion: 2
      m_Curve:
      - serializedVersion: 3
        time: 0
        value: 0
        inSlope: -1.2919028
        outSlope: -1.2919028
        tangentMode: 34
        weightedMode: 0
        inWeight: 0.33333334
        outWeight: 0.33333334
      - serializedVersion: 3
        time: 1.1833333
        value: -1.5287516
        inSlope: -1.1727697
        outSlope: -1.1727697
        tangentMode: 34
        weightedMode: 0
        inWeight: 0.33333334
        outWeight: 0.33333334
      - serializedVersion: 3
        time: 3.7666667
        value: -4.250646
        inSlope: 0.419899
        outSlope: 0.419899
        tangentMode: 34
        weightedMode: 0
        inWeight: 0.33333334
        outWeight: 0.33333334
      - serializedVersion: 3
        time: 6.2
        value: 0.3567108
        inSlope: -0.597819
        outSlope: -0.597819
        tangentMode: 34
        weightedMode: 0
        inWeight: 0.33333334
        outWeight: 0.33333334
      - serializedVersion: 3
        time: 7.866667
        value: -4.791744
        inSlope: 2.5626755
        outSlope: 2.5626755
        tangentMode: 34
        weightedMode: 0
        inWeight: 0.33333334
        outWeight: 0.33333334
      - serializedVersion: 3
        time: 8.45
        value: 0
        inSlope: 4.1072116
        outSlope: 4.1072116
        tangentMode: 34
        weightedMode: 0
        inWeight: 0.33333334
        outWeight: 0.33333334
      - serializedVersion: 3
        time: 9.083333
        value: 0
        inSlope: -1.5675005
        outSlope: -1.5675005
        tangentMode: 0
        weightedMode: 0
        inWeight: 0.8216423
        outWeight: 0.33333334
      m_PreInfinity: 2
      m_PostInfinity: 2
      m_RotationOrder: 4
    attribute: localEulerAnglesRaw.x
    path: 
    classID: 4
    script: {fileID: 0}
  - curve:
      serializedVersion: 2
      m_Curve:
      - serializedVersion: 3
        time: 0
        value: 0
        inSlope: -0.20154612
        outSlope: -0.20154612
        tangentMode: 34
        weightedMode: 0
        inWeight: 0.33333334
        outWeight: 0.33333334
      - serializedVersion: 3
        time: 1.1833333
        value: -0.23849623
        inSlope: -0.3311758
        outSlope: -0.3311758
        tangentMode: 34
        weightedMode: 0
        inWeight: 0.33333334
        outWeight: 0.33333334
      - serializedVersion: 3
        time: 3.7666667
        value: -1.4289104
        inSlope: -0.31361175
        outSlope: -0.31361175
        tangentMode: 34
        weightedMode: 0
        inWeight: 0.33333334
        outWeight: 0.33333334
      - serializedVersion: 3
        time: 6.2
        value: -1.8338609
        inSlope: -0.083209015
        outSlope: -0.083209015
        tangentMode: 34
        weightedMode: 0
        inWeight: 0.33333334
        outWeight: 0.33333334
      - serializedVersion: 3
        time: 7.866667
        value: -1.8338609
        inSlope: 1.5718817
        outSlope: 1.5718817
        tangentMode: 34
        weightedMode: 0
        inWeight: 0.33333334
        outWeight: 0.33333334
      - serializedVersion: 3
        time: 8.45
        value: 0
        inSlope: 1.5718817
        outSlope: 1.5718817
        tangentMode: 34
        weightedMode: 0
        inWeight: 0.33333334
        outWeight: 0.33333334
      - serializedVersion: 3
        time: 9.083333
        value: 0
        inSlope: -0.29118133
        outSlope: -0.29118133
        tangentMode: 0
        weightedMode: 0
        inWeight: 1
        outWeight: 0.33333334
      m_PreInfinity: 2
      m_PostInfinity: 2
      m_RotationOrder: 4
    attribute: localEulerAnglesRaw.y
    path: 
    classID: 4
    script: {fileID: 0}
  - curve:
      serializedVersion: 2
      m_Curve:
      - serializedVersion: 3
        time: 0
        value: 0
        inSlope: -4.7370296
        outSlope: -4.7370296
        tangentMode: 34
        weightedMode: 0
        inWeight: 0.33333334
        outWeight: 0.33333334
      - serializedVersion: 3
        time: 1.1833333
        value: -5.605485
        inSlope: -0.5244143
        outSlope: -0.5244143
        tangentMode: 34
        weightedMode: 0
        inWeight: 0.33333334
        outWeight: 0.33333334
      - serializedVersion: 3
        time: 3.7666667
        value: 3.922368
        inSlope: 0.66131365
        outSlope: 0.66131365
        tangentMode: 34
        weightedMode: 0
        inWeight: 0.33333334
        outWeight: 0.33333334
      - serializedVersion: 3
        time: 6.2
        value: -1.8338609
        inSlope: -1.1827868
        outSlope: -1.1827868
        tangentMode: 34
        weightedMode: 0
        inWeight: 0.33333334
        outWeight: 0.33333334
      - serializedVersion: 3
        time: 7.866667
        value: -1.8338609
        inSlope: 1.7747049
        outSlope: 1.7747049
        tangentMode: 34
        weightedMode: 0
        inWeight: 0.33333334
        outWeight: 0.33333334
      - serializedVersion: 3
        time: 8.383333
        value: 0
        inSlope: 4.164564
        outSlope: 4.164564
        tangentMode: 0
        weightedMode: 0
        inWeight: 0.33333334
        outWeight: 0.8724058
      - serializedVersion: 3
        time: 9.083333
        value: 0
        inSlope: -4.1606216
        outSlope: -4.1606216
        tangentMode: 0
        weightedMode: 0
        inWeight: 0.5674946
        outWeight: 0.8724058
      m_PreInfinity: 2
      m_PostInfinity: 2
      m_RotationOrder: 4
    attribute: localEulerAnglesRaw.z
    path: 
    classID: 4
    script: {fileID: 0}
  - curve:
      serializedVersion: 2
      m_Curve:
      - serializedVersion: 3
        time: 0
        value: 1
        inSlope: 0
        outSlope: 0
        tangentMode: 136
        weightedMode: 0
        inWeight: 0.33333334
        outWeight: 0.33333334
      - serializedVersion: 3
        time: 8.45
        value: 1
        inSlope: 0
        outSlope: 0
        tangentMode: 136
        weightedMode: 0
        inWeight: 0.33333334
        outWeight: 0.33333334
      - serializedVersion: 3
        time: 9.083333
        value: 1
        inSlope: 0
        outSlope: 0
        tangentMode: 136
        weightedMode: 0
        inWeight: 0.33333334
        outWeight: 0.33333334
      m_PreInfinity: 2
      m_PostInfinity: 2
      m_RotationOrder: 4
    attribute: m_LocalScale.x
    path: 
    classID: 4
    script: {fileID: 0}
  - curve:
      serializedVersion: 2
      m_Curve:
      - serializedVersion: 3
        time: 0
        value: 1
        inSlope: 0
        outSlope: 0
        tangentMode: 136
        weightedMode: 0
        inWeight: 0.33333334
        outWeight: 0.33333334
      - serializedVersion: 3
        time: 8.45
        value: 1
        inSlope: 0
        outSlope: 0
        tangentMode: 136
        weightedMode: 0
        inWeight: 0.33333334
        outWeight: 0.33333334
      - serializedVersion: 3
        time: 9.083333
        value: 1
        inSlope: 0
        outSlope: 0
        tangentMode: 136
        weightedMode: 0
        inWeight: 0.33333334
        outWeight: 0.33333334
      m_PreInfinity: 2
      m_PostInfinity: 2
      m_RotationOrder: 4
    attribute: m_LocalScale.y
    path: 
    classID: 4
    script: {fileID: 0}
  - curve:
      serializedVersion: 2
      m_Curve:
      - serializedVersion: 3
        time: 0
        value: 1
        inSlope: 0
        outSlope: 0
        tangentMode: 136
        weightedMode: 0
        inWeight: 0.33333334
        outWeight: 0.33333334
      - serializedVersion: 3
        time: 8.45
        value: 1
        inSlope: 0
        outSlope: 0
        tangentMode: 136
        weightedMode: 0
        inWeight: 0.33333334
        outWeight: 0.33333334
      - serializedVersion: 3
        time: 9.083333
        value: 1
        inSlope: 0
        outSlope: 0
        tangentMode: 136
        weightedMode: 0
        inWeight: 0.33333334
        outWeight: 0.33333334
      m_PreInfinity: 2
      m_PostInfinity: 2
      m_RotationOrder: 4
    attribute: m_LocalScale.z
    path: 
    classID: 4
    script: {fileID: 0}
  m_EulerEditorCurves:
  - curve:
      serializedVersion: 2
      m_Curve: []
      m_PreInfinity: 2
      m_PostInfinity: 2
      m_RotationOrder: 4
    attribute: m_LocalEulerAngles.x
    path: 
    classID: 4
    script: {fileID: 0}
  - curve:
      serializedVersion: 2
      m_Curve: []
      m_PreInfinity: 2
      m_PostInfinity: 2
      m_RotationOrder: 4
    attribute: m_LocalEulerAngles.y
    path: 
    classID: 4
    script: {fileID: 0}
  - curve:
      serializedVersion: 2
      m_Curve: []
      m_PreInfinity: 2
      m_PostInfinity: 2
      m_RotationOrder: 4
    attribute: m_LocalEulerAngles.z
    path: 
    classID: 4
    script: {fileID: 0}
  m_HasGenericRootTransform: 1
  m_HasMotionFloatCurves: 0
  m_Events: []
