%YAML 1.1
%TAG !u! tag:unity3d.com,2011:
--- !u!114 &11400000
MonoBehaviour:
  m_ObjectHideFlags: 0
  m_CorrespondingSourceObject: {fileID: 0}
  m_PrefabInstance: {fileID: 0}
  m_PrefabAsset: {fileID: 0}
  m_GameObject: {fileID: 0}
  m_Enabled: 1
  m_EditorHideFlags: 0
  m_Script: {fileID: 11500000, guid: 08dba62894fb1804482cb68c88412aaa, type: 3}
  m_Name: 0114C55D-3CC0-4CC0-BF79-CF8EC0C9E358
  m_EditorClassIdentifier: 
  objectName: Play_Light_Step
  id: 3234743103
  guid: 0114C55D-3CC0-4CC0-BF79-CF8EC0C9E358
