%YAML 1.1
%TAG !u! tag:unity3d.com,2011:
--- !u!114 &11400000
MonoBehaviour:
  m_ObjectHideFlags: 0
  m_CorrespondingSourceObject: {fileID: 0}
  m_PrefabInstance: {fileID: 0}
  m_PrefabAsset: {fileID: 0}
  m_GameObject: {fileID: 0}
  m_Enabled: 1
  m_EditorHideFlags: 0
  m_Script: {fileID: 11500000, guid: f8c2cf631400f604e84dae9ea7f8597a, type: 3}
  m_Name: Visto com cookie
  m_EditorClassIdentifier: 
  _characters:
  - {fileID: 11400000, guid: 61ffdda4ef1c2bd47bf76042267730cf, type: 2}
  - {fileID: 11400000, guid: 3375a85caa3856b4fab9015f647f7cd1, type: 2}
  dialogBoxes:
  - character: {fileID: 11400000, guid: 3375a85caa3856b4fab9015f647f7cd1, type: 2}
    dialog: "Consegui pegar o cookie, miss\xE3o cumprida!"
  _question: {fileID: 0}
