%YAML 1.1
%TAG !u! tag:unity3d.com,2011:
--- !u!114 &11400000
MonoBehaviour:
  m_ObjectHideFlags: 0
  m_CorrespondingSourceObject: {fileID: 0}
  m_PrefabInternal: {fileID: 0}
  m_GameObject: {fileID: 0}
  m_Enabled: 1
  m_EditorHideFlags: 0
  m_Script: {fileID: 11500000, guid: 6a4422efe71063344a08a75595e50667, type: 3}
  m_Name: Sound Question 2
  m_EditorClassIdentifier: 
  sound: {fileID: 8300000, guid: 168ed70d8cc10704d85af76f59cd3b95, type: 3}
  question: "Complete a m\xFAsica  Se essa rua se essa rua fosse minha eu mandava
    eu mandava ela \u2026?"
  correct_answer: Ladrilhar.
  option_1: Ela brilhar.
  option_2: Ela cantar.
  category: 4
