%YAML 1.1
%TAG !u! tag:unity3d.com,2011:
--- !u!114 &11400000
MonoBehaviour:
  m_ObjectHideFlags: 0
  m_CorrespondingSourceObject: {fileID: 0}
  m_PrefabInternal: {fileID: 0}
  m_GameObject: {fileID: 0}
  m_Enabled: 1
  m_EditorHideFlags: 0
  m_Script: {fileID: 11500000, guid: 6a4422efe71063344a08a75595e50667, type: 3}
  m_Name: Sound Question 69
  m_EditorClassIdentifier: 
  sound: {fileID: 8300000, guid: 6df29f4043e01384b8cfb83564c3fc5e, type: 3}
  question: "De qual novela \xE9 essa m\xFAsica?"
  correct_answer: A favorita
  option_1: Senhora do destino
  option_2: O cafona
  category: 1
