%YAML 1.1
%TAG !u! tag:unity3d.com,2011:
--- !u!114 &11400000
MonoBehaviour:
  m_ObjectHideFlags: 0
  m_CorrespondingSourceObject: {fileID: 0}
  m_PrefabInternal: {fileID: 0}
  m_GameObject: {fileID: 0}
  m_Enabled: 1
  m_EditorHideFlags: 0
  m_Script: {fileID: 11500000, guid: 6a4422efe71063344a08a75595e50667, type: 3}
  m_Name: Sound Question 59
  m_EditorClassIdentifier: 
  question: "E dizer o qu\xEA?"
  correct_answer: "Como \xE9s lindo"
  option_1: Te amo
  option_2: Fica comigo
  category: 5
  sound: {fileID: 8300000, guid: 1159460428e346347b57f0d728dde732, type: 3}
