%YAML 1.1
%TAG !u! tag:unity3d.com,2011:
--- !u!114 &11400000
MonoBehaviour:
  m_ObjectHideFlags: 0
  m_CorrespondingSourceObject: {fileID: 0}
  m_PrefabInternal: {fileID: 0}
  m_GameObject: {fileID: 0}
  m_Enabled: 1
  m_EditorHideFlags: 0
  m_Script: {fileID: 11500000, guid: 6a4422efe71063344a08a75595e50667, type: 3}
  m_Name: Sound Question 36
  m_EditorClassIdentifier: 
  question: "Por que a Palavra \xE9 comparada a isso?"
  correct_answer: Porque deixa um sinal
  option_1: "Porque Ela \xE9 forte"
  option_2: "Porque Ela \xE9 luz"
  category: 5
  sound: {fileID: 8300000, guid: 1849f0cc9dd6f4e47be781145bc6f607, type: 3}
