%YAML 1.1
%TAG !u! tag:unity3d.com,2011:
--- !u!114 &11400000
MonoBehaviour:
  m_ObjectHideFlags: 0
  m_CorrespondingSourceObject: {fileID: 0}
  m_PrefabInternal: {fileID: 0}
  m_GameObject: {fileID: 0}
  m_Enabled: 1
  m_EditorHideFlags: 0
  m_Script: {fileID: 11500000, guid: 6a4422efe71063344a08a75595e50667, type: 3}
  m_Name: Sound Question 141
  m_EditorClassIdentifier: 
  question: "Fa\xE7o o qu\xEA?"
  correct_answer: Meu pedido
  option_1: "Minha ora\xE7\xE3o"
  option_2: Meu louvor
  category: 5
  sound: {fileID: 8300000, guid: b0c4e6406d5ac374aac3ff18495a1228, type: 3}
