%YAML 1.1
%TAG !u! tag:unity3d.com,2011:
--- !u!114 &11400000
MonoBehaviour:
  m_ObjectHideFlags: 0
  m_CorrespondingSourceObject: {fileID: 0}
  m_PrefabInternal: {fileID: 0}
  m_GameObject: {fileID: 0}
  m_Enabled: 1
  m_EditorHideFlags: 0
  m_Script: {fileID: 11500000, guid: 6a4422efe71063344a08a75595e50667, type: 3}
  m_Name: Sound Question 54
  m_EditorClassIdentifier: 
  question: "Essa m\xFAsica \xE9 baseada na ora\xE7\xE3o de qual santo?"
  correct_answer: "S\xE3o Francisco de Assis"
  option_1: "S\xE3o Paulo"
  option_2: "S\xE3o Judas Tadeu"
  category: 5
  sound: {fileID: 8300000, guid: b2a6c169dbe7ae440ba2fb83b96fffd6, type: 3}
