%YAML 1.1
%TAG !u! tag:unity3d.com,2011:
--- !u!114 &11400000
MonoBehaviour:
  m_ObjectHideFlags: 0
  m_CorrespondingSourceObject: {fileID: 0}
  m_PrefabInternal: {fileID: 0}
  m_GameObject: {fileID: 0}
  m_Enabled: 1
  m_EditorHideFlags: 0
  m_Script: {fileID: 11500000, guid: 6a4422efe71063344a08a75595e50667, type: 3}
  m_Name: Sound Question 167
  m_EditorClassIdentifier: 
  question: "Em que momento da Missa essa m\xFAsica \xE9 usada?"
  correct_answer: Ato Penitencial
  option_1: "Ofert\xF3rio"
  option_2: "Comunh\xE3o"
  category: 5
  sound: {fileID: 8300000, guid: 14c146f5f050fad4eae1ec682489403f, type: 3}
