%YAML 1.1
%TAG !u! tag:unity3d.com,2011:
--- !u!114 &11400000
MonoBehaviour:
  m_ObjectHideFlags: 0
  m_CorrespondingSourceObject: {fileID: 0}
  m_PrefabInternal: {fileID: 0}
  m_GameObject: {fileID: 0}
  m_Enabled: 1
  m_EditorHideFlags: 0
  m_Script: {fileID: 11500000, guid: 6a4422efe71063344a08a75595e50667, type: 3}
  m_Name: Sound Question 120
  m_EditorClassIdentifier: 
  sound: {fileID: 8300000, guid: b27a981255d7ad24eac718fefe50b7bc, type: 3}
  question: "Que instrumento \xE9 esse?"
  correct_answer: Guitarra.
  option_1: "Viol\xE3o."
  option_2: Piano
  category: 0
