%YAML 1.1
%TAG !u! tag:unity3d.com,2011:
--- !u!114 &11400000
MonoBehaviour:
  m_ObjectHideFlags: 0
  m_CorrespondingSourceObject: {fileID: 0}
  m_PrefabInternal: {fileID: 0}
  m_GameObject: {fileID: 0}
  m_Enabled: 1
  m_EditorHideFlags: 0
  m_Script: {fileID: 11500000, guid: 6a4422efe71063344a08a75595e50667, type: 3}
  m_Name: Sound Question 171
  m_EditorClassIdentifier: 
  question: "Ensinar o qu\xEA?"
  correct_answer: "F\xE9"
  option_1: "Esperan\xE7a"
  option_2: Paz
  category: 5
  sound: {fileID: 8300000, guid: 7c8ca1b0dc636fb408569d5327f2e31a, type: 3}
