%YAML 1.1
%TAG !u! tag:unity3d.com,2011:
--- !u!114 &11400000
MonoBehaviour:
  m_ObjectHideFlags: 0
  m_CorrespondingSourceObject: {fileID: 0}
  m_PrefabInternal: {fileID: 0}
  m_GameObject: {fileID: 0}
  m_Enabled: 1
  m_EditorHideFlags: 0
  m_Script: {fileID: 11500000, guid: 498604eafdc014b49a4c02a64e167dd1, type: 3}
  m_Name: Text Question 5
  m_EditorClassIdentifier: 
  question: "Qual dessas m\xFAsicas N\xC3O pertence ao Padre Zezinho"
  correct_answer: "Prova de amor maior n\xE3o h\xE1"
  option_1: Amar como Jesus amou
  option_2: "Ora\xE7\xE3o pela fam\xEDlia"
  category: 5
