%YAML 1.1
%TAG !u! tag:unity3d.com,2011:
--- !u!114 &11400000
MonoBehaviour:
  m_ObjectHideFlags: 0
  m_CorrespondingSourceObject: {fileID: 0}
  m_PrefabInternal: {fileID: 0}
  m_GameObject: {fileID: 0}
  m_Enabled: 1
  m_EditorHideFlags: 0
  m_Script: {fileID: 11500000, guid: 6a4422efe71063344a08a75595e50667, type: 3}
  m_Name: Sound Question 108
  m_EditorClassIdentifier: 
  question: Servo de quem?
  correct_answer: De cada homem
  option_1: De Deus
  option_2: De Jesus
  category: 5
  sound: {fileID: 8300000, guid: cc3b7aa37b47e7e449a5323cb4e07826, type: 3}
