%YAML 1.1
%TAG !u! tag:unity3d.com,2011:
--- !u!114 &11400000
MonoBehaviour:
  m_ObjectHideFlags: 0
  m_CorrespondingSourceObject: {fileID: 0}
  m_PrefabInternal: {fileID: 0}
  m_GameObject: {fileID: 0}
  m_Enabled: 1
  m_EditorHideFlags: 0
  m_Script: {fileID: 11500000, guid: 6a4422efe71063344a08a75595e50667, type: 3}
  m_Name: Sound Question 143
  m_EditorClassIdentifier: 
  question: Abrir que portas?
  correct_answer: "Do cora\xE7\xE3o"
  option_1: Da casa
  option_2: Da vida
  category: 5
  sound: {fileID: 8300000, guid: af3a40c60e649014080f6f67065c54c6, type: 3}
