%YAML 1.1
%TAG !u! tag:unity3d.com,2011:
--- !u!114 &11400000
MonoBehaviour:
  m_ObjectHideFlags: 0
  m_CorrespondingSourceObject: {fileID: 0}
  m_PrefabInternal: {fileID: 0}
  m_GameObject: {fileID: 0}
  m_Enabled: 1
  m_EditorHideFlags: 0
  m_Script: {fileID: 11500000, guid: 6a4422efe71063344a08a75595e50667, type: 3}
  m_Name: Sound Question 160
  m_EditorClassIdentifier: 
  sound: {fileID: 8300000, guid: ac266cd70ad63a741bcdea5ccc005d6a, type: 3}
  question: "Que instrumento \xE9 esse?"
  correct_answer: Violino.
  option_1: Trompete.
  option_2: Gaita.
  category: 0
