%YAML 1.1
%TAG !u! tag:unity3d.com,2011:
--- !u!114 &11400000
MonoBehaviour:
  m_ObjectHideFlags: 0
  m_CorrespondingSourceObject: {fileID: 0}
  m_PrefabInternal: {fileID: 0}
  m_GameObject: {fileID: 0}
  m_Enabled: 1
  m_EditorHideFlags: 0
  m_Script: {fileID: 11500000, guid: 6a4422efe71063344a08a75595e50667, type: 3}
  m_Name: Sound Question 98
  m_EditorClassIdentifier: 
  sound: {fileID: 8300000, guid: ec44890a27c166c488a5729fc1ba398e, type: 3}
  question: "Que instrumento \xE9 esse?"
  correct_answer: Chocalho.
  option_1: Castanhola.
  option_2: Harpa.
  category: 0
