%YAML 1.1
%TAG !u! tag:unity3d.com,2011:
--- !u!114 &11400000
MonoBehaviour:
  m_ObjectHideFlags: 0
  m_CorrespondingSourceObject: {fileID: 0}
  m_PrefabInternal: {fileID: 0}
  m_GameObject: {fileID: 0}
  m_Enabled: 1
  m_EditorHideFlags: 0
  m_Script: {fileID: 11500000, guid: 6a4422efe71063344a08a75595e50667, type: 3}
  m_Name: Sound Question 8
  m_EditorClassIdentifier: 
  sound: {fileID: 8300000, guid: 64107fbb4f511a248b33b01f070bc106, type: 3}
  question: "Na m\xFAsica \u201Cpeixe vivo\u201D completem Os pastores desta aldeia
    Fazem prece? "
  correct_answer: Noite e dia.
  option_1: Dia e noite.
  option_2: "Na chegada do crep\xFAsculo."
  category: 4
