[
    {
        "name":"Cho Chang",
        "alternate_names":[],
        "species":"human",
        "gender":"female",
        "house":"Ravenclaw",
        "dateOfBirth":"",
        "yearOfBirth":null,
        "wizard":true,
        "ancestry":"",
        "eyeColour":"brown",
        "hairColour":"black",
        "wand":
        {
            "wood":"",
            "core":"",
            "length":null
        },
        "patronus":"swan",
        "hogwartsStudent":true,
        "hogwartsStaff":false,
        "actor":"Katie Leung",
        "alternate_actors":[],
        "alive":true,
        "image":"https://hp-api.herokuapp.com/images/cho.jpg"
    },
    {
        "name":"Luna Lovegood",
        "alternate_names":[],
        "species":"human",
        "gender":"female",
        "house":"Ravenclaw",
        "dateOfBirth":"13-02-1981",
        "yearOfBirth":1981,
        "wizard":true,
        "ancestry":"",
        "eyeColour":"grey",
        "hairColour":"blonde",
        "wand":
        {
            "wood":"",
            "core":"",
            "length":null
        },
        "patronus":"hare",
        "hogwartsStudent":true,
        "hogwartsStaff":false,
        "actor":"Evanna Lynch",
        "alternate_actors":[],
        "alive":true,
        "image":"https://hp-api.herokuapp.com/images/luna.jpg"
    },
    {
        "name":"Terry Boot",
        "alternate_names":[],
        "species":"human",
        "gender":"male",
        "house":"Ravenclaw",
        "dateOfBirth":"",
        "yearOfBirth":null,
        "wizard":true,
        "ancestry":"",
        "eyeColour":"",
        "hairColour":"",
        "wand":
        {
            "wood":"",
            "core":"",
            "length":null
        },
        "patronus":"",
        "hogwartsStudent":true,
        "hogwartsStaff":false,
        "actor":"Kevin Lee Yi",
        "alternate_actors":[],
        "alive":true,
        "image":""
    },
    {
        "name":"Mandy Brocklehurst",
        "alternate_names":[],
        "species":"human",
        "gender":"female",
        "house":"Ravenclaw",
        "dateOfBirth":"",
        "yearOfBirth":null,
        "wizard":true,
        "ancestry":"",
        "eyeColour":"",
        "hairColour":"",
        "wand":
        {
            "wood":"",
            "core":"",
            "length":null
        },
        "patronus":"",
        "hogwartsStudent":true,
        "hogwartsStaff":false,
        "actor":"Christina Petrou",
        "alternate_actors":[],
        "alive":true,
        "image":""
    },
    {
        "name":"Padma Patil",
        "alternate_names":[],
        "species":"human",
        "gender":"female",
        "house":"Ravenclaw",
        "dateOfBirth":"",
        "yearOfBirth":null,
        "wizard":true,
        "ancestry":"",
        "eyeColour":"",
        "hairColour":"",
        "wand":
        {
            "wood":"",
            "core":"",
            "length":null
        },
        "patronus":"",
        "hogwartsStudent":true,
        "hogwartsStaff":false,
        "actor":"Sharon Sandhu",
        "alternate_actors":["Afshan Azad"],
        "alive":true,
        "image":""
    },
    {
        "name":"Lisa Turpin",
        "alternate_names":[],
        "species":"human",
        "gender":"female",
        "house":"Ravenclaw",
        "dateOfBirth":"",
        "yearOfBirth":null,
        "wizard":true,
        "ancestry":"",
        "eyeColour":"",
        "hairColour":"",
        "wand":
        {
            "wood":"",
            "core":"",
            "length":null
        },
        "patronus":"",
        "hogwartsStudent":true,
        "hogwartsStaff":false,
        "actor":"",
        "alternate_actors":[],
        "alive":true,
        "image":""
    },
    {
        "name":"Filius Flitwick",
        "alternate_names":["Professor Flitwick"],
        "species":"human",
        "gender":"male",
        "house":"Ravenclaw",
        "dateOfBirth":"",
        "yearOfBirth":null,
        "wizard":true,
        "ancestry":"",
        "eyeColour":"",
        "hairColour":"",
        "wand":
        {
            "wood":"",
            "core":"",
            "length":null
        },
        "patronus":"",
        "hogwartsStudent":false,
        "hogwartsStaff":true,
        "actor":"Warwick Davis",
        "alternate_actors":[],
        "alive":true,
        "image":""
    },
    {
        "name":"Moaning Myrtle",
        "alternate_names":["Myrtle Elizabeth Warren"],
        "species":"ghost",
        "gender":"female",
        "house":"Ravenclaw",
        "dateOfBirth":"",
        "yearOfBirth":null,
        "wizard":true,
        "ancestry":"muggleborn",
        "eyeColour":"",
        "hairColour":"",
        "wand":
        {
            "wood":"",
            "core":"",
            "length":null
        },
        "patronus":"",
        "hogwartsStudent":false,
        "hogwartsStaff":false,
        "actor":"Shirley Henderson",
        "alternate_actors":[],
        "alive":false,
        "image":""
    },
    {
        "name":"Penelope Clearwater",
        "alternate_names":["Penny"],
        "species":"human",
        "gender":"female",
        "house":"Ravenclaw",
        "dateOfBirth":"",
        "yearOfBirth":null,
        "wizard":true,
        "ancestry":"",
        "eyeColour":"",
        "hairColour":"",
        "wand":
        {
            "wood":"",
            "core":"",
            "length":null
        },
        "patronus":"",
        "hogwartsStudent":true,
        "hogwartsStaff":false,
        "actor":"Gemma Padley",
        "alternate_actors":[],
        "alive":true,
        "image":""
    },
    {
        "name":"Stewart Ackerley",
        "alternate_names":[],
        "species":"human",
        "gender":"male",
        "house":"Ravenclaw",
        "dateOfBirth":"",
        "yearOfBirth":null,
        "wizard":true,
        "ancestry":"",
        "eyeColour":"",
        "hairColour":"",
        "wand":
        {
            "wood":"",
            "core":"",
            "length":null
        },
        "patronus":"",
        "hogwartsStudent":true,
        "hogwartsStaff":false,
        "actor":"",
        "alternate_actors":[],
        "alive":true,
        "image":""
    },
    {
        "name":"Orla Quirke",
        "alternate_names":[],
        "species":"human",
        "gender":"female",
        "house":"Ravenclaw",
        "dateOfBirth":"",
        "yearOfBirth":null,
        "wizard":true,
        "ancestry":"",
        "eyeColour":"",
        "hairColour":"",
        "wand":
        {
            "wood":"",
            "core":"",
            "length":null
        },
        "patronus":"",
        "hogwartsStudent":true,
        "hogwartsStaff":false,
        "actor":"",
        "alternate_actors":[],
        "alive":true,
        "image":""
    },
    {
        "name":"Fawcett",
        "alternate_names":[],
        "species":"human",
        "gender":"female",
        "house":"Ravenclaw",
        "dateOfBirth":"",
        "yearOfBirth":null,
        "wizard":true,
        "ancestry":"",
        "eyeColour":"",
        "hairColour":"",
        "wand":
        {
            "wood":"",
            "core":"",
            "length":null
        },
        "patronus":"",
        "hogwartsStudent":true,
        "hogwartsStaff":false,
        "actor":"Alex Argenti",
        "alternate_actors":[],
        "alive":true,
        "image":""
    },
    {
        "name":"Stebbins",
        "alternate_names":[],
        "species":"human",
        "gender":"male",
        "house":"Ravenclaw",
        "dateOfBirth":"",
        "yearOfBirth":null,
        "wizard":true,
        "ancestry":"",
        "eyeColour":"",
        "hairColour":"",
        "wand":
        {
            "wood":"",
            "core":"",
            "length":null
        },
        "patronus":"",
        "hogwartsStudent":true,
        "hogwartsStaff":false,
        "actor":"",
        "alternate_actors":[],
        "alive":true,
        "image":""
    },
    {
        "name":"Anthony Goldstein",
        "alternate_names":[],
        "species":"human",
        "gender":"male",
        "house":"Ravenclaw",
        "dateOfBirth":"",
        "yearOfBirth":null,
        "wizard":true,
        "ancestry":"",
        "eyeColour":"",
        "hairColour":"",
        "wand":
        {
            "wood":"",
            "core":"",
            "length":null
        },
        "patronus":"",
        "hogwartsStudent":true,
        "hogwartsStaff":false,
        "actor":"",
        "alternate_actors":[],
        "alive":true,
        "image":""
    },
    {
        "name":"Michael Corner",
        "alternate_names":[],
        "species":"human",
        "gender":"male",
        "house":"Ravenclaw",
        "dateOfBirth":"",
        "yearOfBirth":null,
        "wizard":true,
        "ancestry":"",
        "eyeColour":"",
        "hairColour":"",
        "wand":
        {
            "wood":"",
            "core":"",
            "length":null
        },
        "patronus":"",
        "hogwartsStudent":true,
        "hogwartsStaff":false,
        "actor":"Ryan Nelson",
        "alternate_actors":[],
        "alive":true,
        "image":""
    },
    {
        "name":"Zacharias Smith",
        "alternate_names":[],
        "species":"human",
        "gender":"male",
        "house":"Ravenclaw",
        "dateOfBirth":"",
        "yearOfBirth":null,
        "wizard":true,
        "ancestry":"",
        "eyeColour":"",
        "hairColour":"blond",
        "wand":
        {
            "wood":"",
            "core":"",
            "length":null
        },
        "patronus":"",
        "hogwartsStudent":true,
        "hogwartsStaff":false,
        "actor":"Nick Shirm",
        "alternate_actors":[],
        "alive":true,
        "image":""
    },
    {
        "name":"Marietta Edgecombe",
        "alternate_names":[],
        "species":"human",
        "gender":"female",
        "house":"Ravenclaw",
        "dateOfBirth":"",
        "yearOfBirth":null,
        "wizard":true,
        "ancestry":"",
        "eyeColour":"",
        "hairColour":"blonde",
        "wand":
        {
            "wood":"",
            "core":"",
            "length":null
        },
        "patronus":"",
        "hogwartsStudent":true,
        "hogwartsStaff":false,
        "actor":"",
        "alternate_actors":[],
        "alive":true,
        "image":""
    },
    {
        "name":"Bradley",
        "alternate_names":[],
        "species":"human",
        "gender":"male",
        "house":"Ravenclaw",
        "dateOfBirth":"",
        "yearOfBirth":null,
        "wizard":true,
        "ancestry":"",
        "eyeColour":"",
        "hairColour":"",
        "wand":
        {
            "wood":"",
            "core":"",
            "length":null
        },
        "patronus":"",
        "hogwartsStudent":true,
        "hogwartsStaff":false,
        "actor":"",
        "alternate_actors":[],
        "alive":true,
        "image":""
    },
    {
        "name":"Roger Davies",
        "alternate_names":[],
        "species":"human",
        "gender":"male",
        "house":"Ravenclaw",
        "dateOfBirth":"",
        "yearOfBirth":null,
        "wizard":true,
        "ancestry":"",
        "eyeColour":"",
        "hairColour":"",
        "wand":
        {
            "wood":"",
            "core":"",
            "length":null
        },
        "patronus":"",
        "hogwartsStudent":true,
        "hogwartsStaff":false,
        "actor":"Henry Lloyd-Hughes",
        "alternate_actors":[],
        "alive":true,
        "image":""
    },
    {
        "name":"Eddie Carmichael",
        "alternate_names":[],
        "species":"human",
        "gender":"male",
        "house":"Ravenclaw",
        "dateOfBirth":"",
        "yearOfBirth":null,
        "wizard":true,
        "ancestry":"",
        "eyeColour":"",
        "hairColour":"",
        "wand":
        {
            "wood":"",
            "core":"",
            "length":null
        },
        "patronus":"",
        "hogwartsStudent":true,
        "hogwartsStaff":false,
        "actor":"",
        "alternate_actors":[],
        "alive":true,
        "image":""
    },
    {
        "name":"Marcus Belby",
        "alternate_names":[],
        "species":"human",
        "gender":"male",
        "house":"Ravenclaw",
        "dateOfBirth":"",
        "yearOfBirth":null,
        "wizard":true,
        "ancestry":"",
        "eyeColour":"",
        "hairColour":"",
        "wand":
        {
            "wood":"",
            "core":"",
            "length":null
        },
        "patronus":"",
        "hogwartsStudent":true,
        "hogwartsStaff":false,
        "actor":"Robert Knox",
        "alternate_actors":[],
        "alive":true,
        "image":""
    },
    {
        "name":"Xenophilius Lovegood",
        "alternate_names":[],
        "species":"human",
        "gender":"male",
        "house":"Ravenclaw",
        "dateOfBirth":"",
        "yearOfBirth":null,
        "wizard":true,
        "ancestry":"",
        "eyeColour":"",
        "hairColour":"white",
        "wand":
        {
            "wood":"",
            "core":"",
            "length":null
        },
        "patronus":"",
        "hogwartsStudent":false,
        "hogwartsStaff":false,
        "actor":"Rhys Ifans",
        "alternate_actors":[],
        "alive":true,
        "image":""
    }
]