{
  "version": 8,
  "name": "Updated Style Name",
  "metadata": {},
  "sources": {},
  "layers": [
    {
      "id": "new-layer",
      "type": "background",
      "paint": {
        "background-color": "#111"
      },
      "interactive": true
    }
  ],
  "draft": true
}
