{
  "viewportWidth": 1920,
  "viewportHeight": 1080,
  "requestTimeout": 15000,
  "responseTimeout": 10000,
  "defaultCommandTimeout": 10000,
  "baseUrl": "http://automationpractice.multiformis.com",
  "env": {
    "requestBaseUrl": "https://api.mapbox.com"
  },
  "reporter": "mochawesome",
  "reporterOptions": {
    "reportDir": "cypress/results",
    "overwrite": false,
    "html": false,
    "json": true,
    "timestamp": "mmddyyyy_HHMMss",
    "showSkipped": true,
    "charts": true
  },
  "integrationFolder": "cypress/tests",
  "testFiles": "**/*.spec.js",
  "screenshotsFolder": "cypress/results/assets",
  "videosFolder": "cypress/results/assets/videos",
  "watchForFileChanges": false,
  "chromeWebSecurity": false,
  "video": true
}
