[
  {
    "target": {
      "target_id": 1,
      "name": "foo"
    },
    "timestamp": 0,
    "value": 0
  },
  {
    "target": {
      "target_id": 1,
      "name": "foo"
    },
    "timestamp": 1,
    "value": 1
  },
  {
    "target": {
      "target_id": 1,
      "name": "foo"
    },
    "timestamp": 2,
    "value": 2
  },
  {
    "target": {
      "target_id": 2,
      "name": "bar"
    },
    "timestamp": 0,
    "value": 0
  },
  {
    "target": {
      "target_id": 2,
      "name": "bar"
    },
    "timestamp": 1,
    "value": 1
  },
  {
    "target": {
      "target_id": 2,
      "name": "bar"
    },
    "timestamp": 2,
    "value": 2
  }
]