Event,Sex,Name,State,BodyweightKg,WeightClassKg,Division,Best3SquatKg,Best3BenchKg,Best3DeadliftKg,TotalKg,Equipment,Place
SBD,M,Adam Ramzy,BC,82.5,83,Open,337.5,255.0,305.0,897.5,Single-ply,1
SBD,M,Patrick Winstanley,BC,129.7,120+,Masters 2,50.0,137.5,100.0,287.5,Single-ply,1
SBD,M,Rowan Megale,BC,88.7,93,Sub-Juniors,192.5,117.5,217.5,527.5,Raw,1
SBD,M,Lukas Nering,BC,79.9,83,Sub-Juniors,195.0,120.0,210.0,525.0,Raw,1
SBD,M,Alexander Domingo,BC,78.4,83,Sub-Juniors,155.0,107.5,165.0,427.5,Raw,2
SBD,M,Christien John,BC,72.0,74,Sub-Juniors,165.0,82.5,202.5,450.0,Raw,1
SBD,M,Brian Du,BC,70.4,74,Sub-Juniors,150.0,77.5,197.5,425.0,Raw,2
SBD,M,Benjamin Wagler,BC,65.3,66,Sub-Juniors,102.5,100.0,165.0,367.5,Raw,1
SBD,M,Dickson Giang,BC,57.6,59,Sub-Juniors,127.5,87.5,150.0,365.0,Raw,1
SBD,M,Jaston Dhaliwal,BC,115.5,120,Sub-Juniors,187.5,112.5,210.0,510.0,Raw,1
SBD,M,Wesley Chu,BC,92.0,93,Open,165.0,105.0,180.0,450.0,Raw,8
SBD,M,Ryan Hunt,BC,91.2,93,Open,150.0,105.0,190.0,445.0,Raw,9
SBD,M,Raphael Vecina,BC,91.1,93,Open,185.0,110.0,187.5,482.5,Raw,7
SBD,M,Michael Paine,BC,89.5,93,Open,200.0,140.0,255.0,595.0,Raw,1
SBD,M,Joshua Dunbar,BC,91.1,93,Open,200.0,120.0,275.0,595.0,Raw,2
SBD,M,Joshua Croasdale,BC,92.1,93,Open,195.0,122.5,220.0,537.5,Raw,3
SBD,M,Iain Houghton,BC,87.8,93,Open,170.0,120.0,210.0,500.0,Raw,6
SBD,M,Derek Florko,BC,89.5,93,Open,182.5,132.5,210.0,525.0,Raw,4
SBD,M,Bryan Pham,BC,90.6,93,Open,185.0,112.5,212.5,510.0,Raw,5
SBD,F,Bianca Broadbent,BC,112.4,84+,Open,185.0,97.5,182.5,465.0,Raw,1
SBD,F,Andy Francis,BC,129.4,84+,Open,142.5,80.0,162.5,385.0,Raw,2
SBD,F,Sara Youd,BC,82.8,84,Open,67.5,42.5,95.0,205.0,Raw,1
SBD,M,Ryan MacLellan,BC,82.1,83,Open,155.0,172.5,200.0,527.5,Raw,3
SBD,M,Nam Hee Kim,BC,75.1,83,Open,162.5,95.0,192.5,450.0,Raw,4
SBD,M,Matt Leung,BC,80.5,83,Open,202.5,137.5,240.0,580.0,Raw,1
SBD,M,Jacky Szeto,BC,83.0,83,Open,182.5,130.0,220.0,532.5,Raw,2
SBD,M,Trevor Ng,BC,72.7,74,Open,200.0,100.0,160.0,460.0,Raw,3
SBD,M,Taylor Danggas,BC,73.4,74,Open,162.5,150.5,197.5,510.5,Raw,2
SBD,M,Nathan Ly,BC,73.2,74,Open,200.0,115.0,232.5,547.5,Raw,1
SBD,M,Aaron Dixon,BC,68.5,74,Open,152.5,100.0,185.0,437.5,Raw,4
SBD,F,Shayla Fowler,BC,70.5,72,Open,110.0,65.0,120.0,295.0,Raw,2
SBD,F,Kama Guezalova,BC,71.4,72,Open,122.5,67.5,132.5,322.5,Raw,1
SBD,F,Emily Duncan,BC,69.6,72,Open,102.5,60.0,110.0,272.5,Raw,3
SBD,M,Ryun Laniec,BC,65.4,66,Open,180.0,132.5,215.0,527.5,Raw,1
SBD,M,Benjamin Yu,BC,65.2,66,Open,145.0,115.0,165.0,425.0,Raw,2
SBD,F,Taylor Mason,BC,62.5,63,Open,102.5,55.0,120.0,277.5,Raw,3
SBD,F,Shadie Bourget,BC,62.2,63,Open,105.0,72.5,140.0,317.5,Raw,2
SBD,F,Pier Briggeman,BC,59.6,63,Open,130.0,72.5,160.0,362.5,Raw,1
SBD,F,Nicole Hart #1,BC,60.5,63,Open,102.5,52.5,120.0,275.0,Raw,4
SBD,F,Jes Von Henzke,BC,60.2,63,Open,85.0,50.0,92.5,227.5,Raw,5
SBD,M,Patrick Tan,BC,56.4,59,Open,85.0,45.0,90.0,220.0,Raw,1
SBD,F,Catherine Phan,BC,51.7,52,Open,87.5,47.5,115.0,250.0,Raw,1
SBD,F,Rafaela Kirloss,BC,45.9,47,Open,65.0,45.0,100.0,210,Raw,2
SBD,F,Jean Hu,BC,46.0,47,Open,92.5,42.5,125.0,260.0,Raw,1
SBD,M,Ben Borger,BC,159.0,120+,Open,247.5,150.0,265.0,662.5,Raw,1
SBD,M,Zhuhao Chen,BC,116.8,120,Open,152.5,115.0,232.5,500.0,Raw,4
SBD,M,Nathan Coleman,BC,113.5,120,Open,167.5,105.0,227.5,500.0,Raw,3
SBD,M,Derek Goodswimmer,BC,118.5,120,Open,255.0,150.0,305.0,710.0,Raw,1
SBD,M,Arthur Field,BC,115.4,120,Open,180.0,102.5,227.5,510.0,Raw,2
SBD,M,Jorge Aust,BC,102.0,105,Open,175.0,107.5,227.5,510.0,Raw,2
SBD,M,Greg Kowatski,BC,102.7,105,Open,177.5,117.5,250.0,545.0,Raw,1
SBD,F,Sharlene Brunjes,BC,60.0,63,Masters 3,65.0,47.5,95.0,207.5,Raw,1
SBD,F,Meghan O'Connell,BC,55.4,57,Masters 2,52.5,45.0,80.0,177.5,Raw,1
SBD,M,Marc Nering,BC,102.3,105,Masters 2,215.0,140.0,240.0,595.0,Raw,1
SBD,M,Jason Allard,BC,91.3,93,Masters 1,195.0,127.0,230.0,552.5,Raw,2
SBD,M,Conrad Cowan,BC,92.0,93,Masters 1,185.0,140.0,230.0,555.0,Raw,1
SBD,M,Blair Kuzyk,BC,90.3,93,Masters 1,60.0,105.0,60.0,225.0,Raw,3
SBD,F,Mary-Ann Middleton,BC,81.3,84,Masters 1,102.5,62.5,140.0,305.0,Raw,1
SBD,F,Shelley Lessard,BC,67.7,72,Masters 1,102.5,60.0,140.0,302.5,Raw,1
SBD,F,Rachel Carswell,BC,71.8,72,Masters 1,82.5,42.5,112.5,237.5,Raw,2
SBD,F,Pilar Bradshaw,BC,61.3,63,Masters 1,82.5,55.0,115.0,252.5,Raw,1
SBD,F,Carmela Smythe,BC,60.0,63,Masters 1,82.5,42.5,105.0,230.0,Raw,2
SBD,M,Gordon Langfield,BC,99.9,105,Masters 1,180.0,167.5,222.5,570.0,Raw,1
SBD,M,Ritchy Tran,BC,88.2,93,Juniors,230.0,135.0,272.5,637.5,Raw,1
SBD,M,Richard Yamaguchi,BC,90.8,93,Juniors,215.0,95.0,232.5,542.5,Raw,2
SBD,M,Arsham Gill,BC,91.1,93,Juniors,185.0,115.0,212.5,512.5,Raw,3
SBD,F,Mysha Prokopchuk,BC,73.5,84,Juniors,125.0,62.5,142.5,330.0,Raw,1
SBD,F,Kate Balen,BC,83.2,84,Juniors,107.5,70.0,147.5,325.0,Raw,2
SBD,M,Judah Michael,BC,82.8,83,Juniors,165.0,112.5,215.0,492.5,Raw,2
SBD,M,Jesse Dalla Vecchia,BC,78.5,83,Juniors,182.5,137.5,200.0,520.0,Raw,1
SBD,M,Graeme Gerlach,BC,78.6,83,Juniors,167.5,112.5,172.5,452.5,Raw,4
SBD,M,Colin Shariff,BC,79.7,83,Juniors,155.0,117.5,205.0,477.5,Raw,3
SBD,M,Raymond Huynh,BC,67.7,74,Juniors,142.5,85.0,162.5,390.0,Raw,3
SBD,M,Melvin Wong,BC,72.7,74,Juniors,157.5,100.0,200.0,457.5,Raw,1
SBD,M,Ian Lim,BC,74.0,74,Juniors,142.5,95.0,217.5,455.0,Raw,2
SBD,F,Gabrielle Ghag,BC,70.6,72,Juniors,105.0,60.0,132.5,297.5,Raw,1
SBD,F,Caitlin Chan-McLeod,BC,64.0,72,Juniors,87.5,50.0,122.5,260.0,Raw,2
SBD,M,Ricky Ly,BC,65.3,66,Juniors,170.0,102.5,190.0,462.5,Raw,1
SBD,M,Jonathan Kwok,BC,64.5,66,Juniors,150.0,97.5,192.5,440.0,Raw,2
SBD,M,Jan Agovida,BC,63.6,66,Juniors,145.0,97.5,180.0,422.5,Raw,3
SBD,F,Natalie Repole,BC,63.0,63,Juniors,102.5,47.5,125.0,275.0,Raw,2
SBD,F,Dana Maternick,BC,62.7,63,Juniors,105.0,55.0,120.0,280.0,Raw,1
SBD,M,Jack Liu,BC,58.1,59,Juniors,117.5,100.0,145.0,362.5,Raw,1
SBD,M,Russell Manning,BC,113.3,120,Juniors,192.5,115.0,220.0,527.5,Raw,2
SBD,M,Dilawar Paul,BC,105.7,120,Juniors,215.0,155.0,282.5,652.5,Raw,1
