Division,WeightClassKg,Place,Name,Team,BodyweightKg,Best3SquatKg,Best3BenchKg,Best3DeadliftKg,TotalKg,Equipment,Event,Sex
Div 2,51.71,1,Jose Sanchez,Gilmer,50.08,170.1,97.52,165.56,433.18,Single-ply,SBD,M
Div 2,51.71,2,Bryan Quinteros,Lamesa,51.53,156.49,86.18,158.76,401.43,Single-ply,SBD,M
Div 2,51.71,3,Brandon Horst,Sanger,51.44,163.29,83.91,149.69,396.89,Single-ply,SBD,M
Div 2,51.71,4,Angel Barrosso,Tyler Chapel Hill,51.53,151.95,90.72,154.22,396.89,Single-ply,SBD,M
Div 2,51.71,5,Brandon Fernandez,Poteet,48.9,154.22,88.45,151.95,394.63,Single-ply,SBD,M
Div 2,51.71,6,Angel Rico,Kennedale,51.71,142.88,77.11,170.1,390.09,Single-ply,SBD,M
Div 2,51.71,7,Joey Longoria,Pearsall,50.44,145.15,79.38,156.49,381.02,Single-ply,SBD,M
Div 2,51.71,8,Preston Fox,Lampasas,51.53,136.08,95.25,149.69,381.02,Single-ply,SBD,M
Div 2,51.71,9,Colt Baranowski,Smithville,50.8,136.08,68.04,151.95,356.07,Single-ply,SBD,M
Div 2,51.71,10,Keithon Glenn,Jasper,50.89,127.01,72.57,142.88,342.46,Single-ply,SBD,M
Div 2,51.71,DQ,Lukthaddeus Collins,Jasper,51.44,,,,,Single-ply,SBD,M
Div 2,55.79,1,Diego Rivera,Mexia,54.7,201.85,117.93,197.31,517.1,Single-ply,SBD,M
Div 2,55.79,2,Eric Reaper,Tyler Chapel Hill,54.7,199.58,117.93,181.44,498.95,Single-ply,SBD,M
Div 2,55.79,3,Eduardo Perez,Venus,55.43,192.78,104.33,185.97,483.08,Single-ply,SBD,M
Div 2,55.79,4,Omar Alonso,Snyder,55.7,179.17,115.67,172.37,467.2,Single-ply,SBD,M
Div 2,55.79,5,Chris Jackson #11,Sweetwater,54.79,158.76,117.93,167.83,444.52,Single-ply,SBD,M
Div 2,55.79,6,Chris Anderson #11,Ingleside,55.25,172.37,77.11,183.7,433.18,Single-ply,SBD,M
Div 2,55.79,7,Daniel Jeronimo,Hidalgo Early College,55.25,172.37,90.72,163.29,426.38,Single-ply,SBD,M
Div 2,55.79,8,Joe Cullum,Kennedale,55.7,174.63,92.99,149.69,417.3,Single-ply,SBD,M
Div 2,55.79,9,Jose Hernandez #13,Corpus Christi West Oso,55.79,167.83,81.65,167.83,417.3,Single-ply,SBD,M
Div 2,55.79,10,Landon Warren,Bullard,55.79,158.76,92.99,165.56,417.3,Single-ply,SBD,M
Div 2,55.79,11,Lane Anthony,Nevada Community,55.25,170.1,74.84,165.56,410.5,Single-ply,SBD,M
Div 2,55.79,12,Briley Green,Glen Rose,55.07,136.08,92.99,174.63,403.7,Single-ply,SBD,M
Div 2,55.79,13,Jordon Trevino,Bay City,54.7,154.22,74.84,172.37,401.43,Single-ply,SBD,M
Div 2,55.79,14,Lucas Collins,Jasper,55.07,136.08,74.84,161.03,371.95,Single-ply,SBD,M
Div 2,55.79,DQ,Noah Pachicano,Taylor,53.98,,,,,Single-ply,SBD,M
Div 2,59.87,1,Marcus Capetillo,Raymondville,59.15,210.92,122.47,197.31,530.7,Single-ply,SBD,M
Div 2,59.87,2,Justin Ormsby,Big Spring,58.88,199.58,99.79,208.65,508.02,Single-ply,SBD,M
Div 2,59.87,3,Ty Diaz,Andrews,58.06,195.04,102.06,206.38,503.49,Single-ply,SBD,M
Div 2,59.87,4,Dillon Graves,Glen Rose,59.33,192.78,113.4,190.51,496.68,Single-ply,SBD,M
Div 2,59.87,5,Tye'Rus Jones,Brownwood,59.69,179.17,108.86,197.31,485.34,Single-ply,SBD,M
Div 2,59.87,6,Noe Herrera,Kingsville King,59.6,185.97,99.79,188.24,474,Single-ply,SBD,M
Div 2,59.87,7,Xavier Parker,Mineral Wells,59.24,170.1,104.33,192.78,467.2,Single-ply,SBD,M
Div 2,59.87,8,DeAndre Limbrick,Jasper,57.24,174.63,97.52,190.51,462.66,Single-ply,SBD,M
Div 2,59.87,9,Dalton Waller,Princeton,59.33,163.29,97.52,192.78,453.59,Single-ply,SBD,M
Div 2,59.87,10,Zaahid Abdullah,Waxahachie Life,58.69,167.83,106.59,174.63,449.06,Single-ply,SBD,M
Div 2,59.87,DQ,Payton Samuel,Jasper,58.97,,,,,Single-ply,SBD,M
Div 2,67.13,1,Collin Kovarcik,Needville,66.22,251.74,129.27,233.6,614.62,Single-ply,SBD,M
Div 2,67.13,2,Tyler Bush,Rio Hondo,66.68,231.33,147.42,210.92,589.67,Single-ply,SBD,M
Div 2,67.13,3,Chance Marler,Victoria St. Joseph,65.14,231.33,122.47,224.53,578.33,Single-ply,SBD,M
Div 2,67.13,4,Orlando Gutierrez,Crystal City,66.04,260.82,102.06,210.92,573.79,Single-ply,SBD,M
Div 2,67.13,5,Josue Becerril,Perryton,66.95,208.65,131.54,231.33,571.53,Single-ply,SBD,M
Div 2,67.13,6,Eric Perez,Cleveland,66.59,210.92,113.4,233.6,557.92,Single-ply,SBD,M
Div 2,67.13,7,Roman Ornelaz,San Antonio Holy Cross,65.32,199.58,120.2,224.53,544.31,Single-ply,SBD,M
Div 2,67.13,8,Israel Castillo,Venus,66.86,233.6,113.4,197.31,544.31,Single-ply,SBD,M
Div 2,67.13,9,Nicholas Reid,Anna,66.32,229.06,111.13,197.31,537.51,Single-ply,SBD,M
Div 2,67.13,10,Britin Garcia,Andrews,65.95,206.38,129.27,197.31,532.97,Single-ply,SBD,M
Div 2,67.13,11,Garrett Davis,Quinlan Ford,66.32,213.19,113.4,181.44,508.02,Single-ply,SBD,M
Div 2,67.13,12,Stephen Leal,Taylor,66.13,208.65,108.86,176.9,494.42,Single-ply,SBD,M
Div 2,67.13,DQ,Mike Acevedo,Anna,65.32,,,,,Single-ply,SBD,M
Div 2,67.13,DQ,Damion Brown,Bullard,65.41,,,,,Single-ply,SBD,M
Div 2,74.84,1,Jerkerion Simmons,Jasper,73.21,258.55,172.37,288.03,718.94,Single-ply,SBD,M
Div 2,74.84,2,Steven Ramirez,Devine,73.03,267.62,158.76,242.67,669.05,Single-ply,SBD,M
Div 2,74.84,3,Sean Williams,Lampasas,72.03,249.48,161.03,247.21,657.71,Single-ply,SBD,M
Div 2,74.84,4,Leo Sustaita,Gainesville,73.03,254.01,151.95,231.33,637.3,Single-ply,SBD,M
Div 2,74.84,5,Dominic Ramos,Rio Hondo,74.03,226.8,183.7,210.92,621.42,Single-ply,SBD,M
Div 2,74.84,6,Bobby Posey,Brownsboro,72.21,217.72,122.47,204.12,544.31,Single-ply,SBD,M
Div 2,74.84,DQ,Jacob Nash,Atlanta,73.39,217.72,,,,Single-ply,SBD,M
Div 2,74.84,DQ,Hunter Angelo,Orange Little Cypress-Mauriceville,71.12,,,,,Single-ply,SBD,M
Div 2,74.84,DQ,AJ Castaneda,Bellville,74.84,233.6,151.95,,,Single-ply,SBD,M
Div 2,74.84,DQ,Brock Martin,Argyle,73.3,213.19,124.74,,,Single-ply,SBD,M
Div 2,74.84,DQ,Ayden Pacheco,Andrews,72.39,204.12,104.33,,,Single-ply,SBD,M
Div 2,82.1,1,Ismael Franco,Crystal City,78.2,272.16,167.83,240.4,680.39,Single-ply,SBD,M
Div 2,82.1,2,Enrique Barron,Snyder,80.74,272.16,158.76,240.4,671.32,Single-ply,SBD,M
Div 2,82.1,3,Lucas Byrd,Devine,79.56,265.35,154.22,242.67,662.24,Single-ply,SBD,M
Div 2,82.1,4,Robert Herndon,Perryton,81.56,263.08,151.95,235.87,650.91,Single-ply,SBD,M
Div 2,82.1,5,Austin Ballard,Bonham,80.38,251.74,142.88,231.33,625.96,Single-ply,SBD,M
Div 2,82.1,6,Jaxon Hevron,Paris North Lamar,80.92,233.6,145.15,226.8,605.55,Single-ply,SBD,M
Div 2,82.1,7,Jansen Mattingly,Bullard,79.65,235.87,129.27,226.8,591.94,Single-ply,SBD,M
Div 2,82.1,8,Roy DeLeon,Somerset,78.29,219.99,147.42,222.26,589.67,Single-ply,SBD,M
Div 2,82.1,9,Ethan McKay,Orange Little Cypress-Mauriceville,80.1,222.26,136.08,219.99,578.33,Single-ply,SBD,M
Div 2,82.1,10,Andrew Wyatt,Smithville,79.11,208.65,142.88,224.53,576.06,Single-ply,SBD,M
Div 2,82.1,11,Ben Roberson,Robinson,80.65,226.8,129.27,215.46,571.53,Single-ply,SBD,M
Div 2,82.1,12,Lonnie Foster,Silsbee,79.65,215.46,113.4,229.06,557.92,Single-ply,SBD,M
Div 2,82.1,DQ,Chon Hernandez,Gainesville,76.75,,,,,Single-ply,SBD,M
Div 2,89.81,1,Dalton Richardson,Midland Greenwood,86.91,283.5,147.42,272.16,703.07,Single-ply,SBD,M
Div 2,89.81,2,Daniel Gonzalez,Kingsville King,87.09,281.23,154.22,267.62,703.07,Single-ply,SBD,M
Div 2,89.81,3,Witt Dockens,Center,87.63,278.96,183.7,240.4,703.07,Single-ply,SBD,M
Div 2,89.81,4,Michael Nguyen,Lampasas,88.09,247.21,174.63,256.28,678.12,Single-ply,SBD,M
Div 2,89.81,5,Austin Cartwright,Cleveland,89.45,272.16,145.15,256.28,673.58,Single-ply,SBD,M
Div 2,89.81,6,Joseph Bueno,Somerset,88.72,272.16,136.08,251.74,659.98,Single-ply,SBD,M
Div 2,89.81,7,JaShaughn Hatcher,Fairfield,86.27,247.21,140.61,260.82,648.64,Single-ply,SBD,M
Div 2,89.81,8,Nomar Rivera,Smithville,87.09,244.94,149.69,249.48,644.1,Single-ply,SBD,M
Div 2,89.81,9,Quade Miller,Needville,87.09,249.48,147.42,238.14,635.03,Single-ply,SBD,M
Div 2,89.81,10,Mark Thomas,Decatur,83.37,226.8,129.27,256.28,612.35,Single-ply,SBD,M
Div 2,89.81,DQ,Austin Dickson,Anna,88.45,251.74,,,,Single-ply,SBD,M
Div 2,89.81,DQ,Gerardo Cabrera,Snyder,87.36,,,,,Single-ply,SBD,M
Div 2,99.79,1,Jose Zaragoza,West Columbia,97.79,294.84,161.03,285.76,741.62,Single-ply,SBD,M
Div 2,99.79,2,Uriel Hernandez,Perryton,98.16,288.03,181.44,249.48,718.94,Single-ply,SBD,M
Div 2,99.79,3,Jaime Morales,Cleveland,94.89,283.5,142.88,276.69,703.07,Single-ply,SBD,M
Div 2,99.79,4,Ricardo Pena #2,Kennedale,98.07,288.03,172.37,242.67,703.07,Single-ply,SBD,M
Div 2,99.79,5,Christopher Flores,Hillsboro,96.62,272.16,192.78,233.6,698.53,Single-ply,SBD,M
Div 2,99.79,6,Chris Taylor #3,Caddo Mills,98.25,290.3,151.95,251.74,694,Single-ply,SBD,M
Div 2,99.79,7,Ian Alvidrez,Seminole,96.71,276.69,163.29,244.94,684.92,Single-ply,SBD,M
Div 2,99.79,8,Cameron Hanna,Kennedale,97.89,272.16,124.74,260.82,657.71,Single-ply,SBD,M
Div 2,99.79,9,Raul Fernandez,Rockport-Fulton,97.98,263.08,142.88,244.94,650.91,Single-ply,SBD,M
Div 2,99.79,10,Corbin Rodriguez,Madisonville,95.8,244.94,158.76,244.94,648.64,Single-ply,SBD,M
Div 2,99.79,11,Matthew Carter #2,Liberty Hill,96.25,254.01,149.69,240.4,644.1,Single-ply,SBD,M
Div 2,99.79,12,Manuel Garcia,Somerset,95.07,256.28,140.61,199.58,596.47,Single-ply,SBD,M
Div 2,99.79,DQ,Justin Flores,Rio Hondo,94.44,,,,,Single-ply,SBD,M
Div 2,99.79,DQ,Franco Arce,Zapata,98.88,306.17,156.49,,,Single-ply,SBD,M
Div 2,99.79,DQ,Adam Altrech,Needville,94.35,,,,,Single-ply,SBD,M
Div 2,99.79,DQ,Hunter Bagley,Iowa Park,97.79,254.01,149.69,,,Single-ply,SBD,M
Div 2,99.79,DQ,Gilbert Arriaga,Kingsville King,97.89,272.16,,,,Single-ply,SBD,M
Div 2,109.77,1,Eddie Moreno,Somerset,108.86,308.44,204.12,263.08,775.64,Single-ply,SBD,M
Div 2,109.77,2,Asael Lagos,Gainesville,104.33,288.03,147.42,290.3,725.75,Single-ply,SBD,M
Div 2,109.77,3,Ismael Gonzalez,Kingsville King,107.41,281.23,163.29,238.14,682.66,Single-ply,SBD,M
Div 2,109.77,4,Alejandro Rangel,Celina,107.86,283.5,154.22,238.14,675.85,Single-ply,SBD,M
Div 2,109.77,5,Nic Lara,Glen Rose,101.24,269.89,158.76,222.26,650.91,Single-ply,SBD,M
Div 2,109.77,6,Roger Craig,Burnet,107.59,249.48,158.76,240.4,648.64,Single-ply,SBD,M
Div 2,109.77,7,Jack Fontenot,Bridge City,103.15,294.84,142.88,208.65,646.37,Single-ply,SBD,M
Div 2,109.77,8,Macario Rivera,Snyder,107.68,254.01,154.22,226.8,635.03,Single-ply,SBD,M
Div 2,109.77,9,Alvaro Andrade,Hamshire-Fannett,109.13,249.48,136.08,215.46,601.01,Single-ply,SBD,M
Div 2,109.77,DQ,Jacob McCain,Caddo Mills,107.77,258.55,,,,Single-ply,SBD,M
Div 2,109.77,DQ,Alexis Gonzalez #1,Denver City,106.87,,,,,Single-ply,SBD,M
Div 2,109.77,DQ,Blake Tredway,Anna,107.5,324.32,185.97,,,Single-ply,SBD,M
Div 2,109.77,DQ,Deonundre Hatton,Palestine,108.41,,,,,Single-ply,SBD,M
Div 2,124.74,1,Dakoda Trull,Llano,121.47,390.09,226.8,258.55,875.43,Single-ply,SBD,M
Div 2,124.74,2,Marquell Hale,Silsbee,112.22,294.84,183.7,260.82,739.36,Single-ply,SBD,M
Div 2,124.74,3,Joseph Cotie,Cleveland,122.47,278.96,213.19,247.21,739.36,Single-ply,SBD,M
Div 2,124.74,4,Kobe Fahntrapp,Snyder,122.83,317.51,192.78,226.8,737.09,Single-ply,SBD,M
Div 2,124.74,5,Daniel Dowling,Bonham,113.22,308.44,195.04,222.26,725.75,Single-ply,SBD,M
Div 2,124.74,6,Garrett Hayes,Athens,121.2,285.76,154.22,285.76,725.75,Single-ply,SBD,M
Div 2,124.74,7,Wilson Tran,Gainesville,118.3,301.64,163.29,249.48,714.41,Single-ply,SBD,M
Div 2,124.74,8,Dylan Hatfield,Geronimo Navarro,122.47,285.76,188.24,238.14,712.14,Single-ply,SBD,M
Div 2,124.74,9,Jairo Rodriguez,Waco La Vega,123.83,285.76,167.83,242.67,696.26,Single-ply,SBD,M
Div 2,124.74,10,Jarod Rose,Midland Greenwood,120.75,281.23,156.49,249.48,687.19,Single-ply,SBD,M
Div 2,124.74,11,Kolt Stephens,Mabank,121.56,276.69,165.56,244.94,687.19,Single-ply,SBD,M
Div 2,124.74,12,Troy Macias,Rio Hondo,122.47,254.01,183.7,233.6,671.32,Single-ply,SBD,M
Div 2,124.74+,1,Michael Willer,Sweeny,147.6,344.73,208.65,288.03,841.41,Single-ply,SBD,M
Div 2,124.74+,2,Matt Kelley,Caddo Mills,140.16,385.55,190.51,263.08,839.15,Single-ply,SBD,M
Div 2,124.74+,3,Austin Norton,Nevada Community,127.37,351.53,215.46,249.48,816.47,Single-ply,SBD,M
Div 2,124.74+,4,Oscar Castillo,Pleasanton,136.62,331.12,226.8,244.94,802.86,Single-ply,SBD,M
Div 2,124.74+,5,Caleb Jennings,Bridgeport,137.53,303.91,204.12,278.96,786.98,Single-ply,SBD,M
Div 2,124.74+,6,Isaias Hernandez,Hillsboro,139.34,340.19,183.7,256.28,780.18,Single-ply,SBD,M
Div 2,124.74+,7,Devon King,Gilmer,145.15,317.51,181.44,272.16,771.11,Single-ply,SBD,M
Div 2,124.74+,8,John Woods,Sweeny,165.56,285.76,210.92,242.67,739.36,Single-ply,SBD,M
Div 2,124.74+,9,Miguel Rodriguez,Gainesville,144.24,306.17,181.44,249.48,737.09,Single-ply,SBD,M
Div 2,124.74+,10,Anthony Cuellar,Andrews,131.45,285.76,195.04,226.8,707.6,Single-ply,SBD,M
Div 2,124.74+,11,Daniel Martinez #9,Beeville Jones,138.71,274.42,192.78,231.33,698.53,Single-ply,SBD,M
Div 2,124.74+,12,Kaleb Barho,Smithville,128.91,317.51,158.76,219.99,696.26,Single-ply,SBD,M
Div 2,124.74+,DQ,Sebastian Enriquez,Fort Stockton,128.73,297.1,,,,Single-ply,SBD,M
