	add     	addi   
	addu    	addui  
	and     	andi   
	beqz    	bnez   
	j       	jal    
	jr      	lw     
	nop     	or     
	ori     	seq    
	seqi    	sge    
	sgei    	sgt    
	sgti    	sle    
	slei    	sll    
	slli    	slt    
	slti    	sne    
	snei    	sra    
	srl     	srli   
	sub     	subi   
	subu    	subui  
	sw      	xor    
	xori   
