 
****************************************
Report : power
        -analysis_effort low
Design : DLX_IR_SIZE32_PC_SIZE32
Version: K-2015.06
Date   : Mon Sep 19 17:15:11 2016
****************************************


Library(s) Used:

    NangateOpenCellLibrary (File: /run/media/marco/Dati/GoogleDrive/Uni/4-2/ME/Project/DLX_Project/Src/DLX_vhd/synthesis/library/NangateOpenCellLibrary_typical_ecsm.db)


Operating Conditions: typical   Library: NangateOpenCellLibrary
Wire Load Model Mode: top

Design        Wire Load Model            Library
------------------------------------------------
DLX_IR_SIZE32_PC_SIZE32
                       5K_hvratio_1_1    NangateOpenCellLibrary


Global Operating Voltage = 1.1  
Power-specific unit information :
    Voltage Units = 1V
    Capacitance Units = 1.000000ff
    Time Units = 1ns
    Dynamic Power Units = 1uW    (derived from V,C,T units)
    Leakage Power Units = 1nW


  Cell Internal Power  =  17.5226 mW   (92%)
  Net Switching Power  =   1.5469 mW    (8%)
                         ---------
Total Dynamic Power    =  19.0695 mW  (100%)

Cell Leakage Power     = 628.1191 uW


                 Internal         Switching           Leakage            Total
Power Group      Power            Power               Power              Power   (   %    )  Attrs
--------------------------------------------------------------------------------------------------
io_pad             0.0000            0.0000            0.0000            0.0000  (   0.00%)
memory             0.0000            0.0000            0.0000            0.0000  (   0.00%)
black_box          0.0000            0.0000            0.0000            0.0000  (   0.00%)
clock_network      0.0000            0.0000            0.0000            0.0000  (   0.00%)
register       1.7079e+04          157.5393        2.7911e+05        1.7516e+04  (  88.92%)
sequential         3.7453            0.1178        6.4893e+03           10.3524  (   0.05%)
combinational    439.7891        1.3892e+03        3.4252e+05        2.1715e+03  (  11.02%)
--------------------------------------------------------------------------------------------------
Total          1.7523e+04 uW     1.5469e+03 uW     6.2812e+05 nW     1.9698e+04 uW
1
