<svg width="164" height="67" viewBox="0 0 164 67" fill="none" xmlns="http://www.w3.org/2000/svg">
<g clip-path="url(#clip0)">
<path d="M139.4 25.784L163.586 10.7034V14.793L139.4 29.9375L115.181 14.793V10.7034L139.4 25.784Z" fill="#F8991C"/>
<path d="M139.4 6.86932C133.936 6.86932 129.143 9.61705 126.396 13.8665C126.619 13.6428 126.747 13.515 126.971 13.3553C133.776 7.70003 143.585 8.97804 148.921 16.103L152.467 13.8345C149.656 9.71291 144.831 6.86932 139.4 6.86932Z" fill="#F8991C"/>
<path d="M139.399 13.8665C136.428 13.8665 133.808 15.3681 132.243 17.5408C133.521 16.6142 134.99 16.1349 136.556 16.1349C139.176 16.1349 141.508 17.4769 143.074 19.7453L146.461 17.6366C144.991 15.3042 142.371 13.8665 139.399 13.8665Z" fill="#F8991C"/>
<path d="M123.041 7.732C133.009 -0.127798 147.099 2.01288 154.608 12.4607L154.672 12.5246L158.346 10.2561C154.32 4.08964 147.323 0 139.399 0C131.54 0 124.543 4.02574 120.453 10.2561C121.188 9.42536 122.114 8.43491 123.041 7.732Z" fill="#F8991C"/>
<path d="M22.0138 38.2766V23.835H26.7425V38.1169C26.7425 41.5995 29.6499 42.4302 31.2794 42.4302C34.8259 42.4302 36.0081 40.3214 36.0081 39.1073V23.835H40.7367V46.2642H37.989L36.1359 43.7082C34.8578 45.2738 32.7491 46.6796 29.618 46.6796C25.113 46.7115 22.0138 43.7401 22.0138 38.2766Z" fill="#2D2D2D"/>
<path d="M75.7864 15.9433V46.2961H78.4702L80.2275 43.7401C81.5055 45.3057 83.6142 46.7754 86.7454 46.7754C90.9309 46.7754 94.4454 44.2194 94.4454 38.5642V31.6309C94.4454 25.9757 90.8989 23.4197 86.5217 23.4197C83.4864 23.4197 81.4416 24.7616 80.3553 26.1035V15.9113L75.7864 15.9433ZM85.4034 42.4621C82.496 42.4621 80.3872 41.0563 80.4511 37.989V31.8226C80.4511 29.4263 82.3682 27.5732 85.4673 27.5732C87.6719 27.5732 89.8445 29.2027 89.8445 31.8226V38.1168C89.8445 40.8965 87.608 42.4621 85.4034 42.4621Z" fill="#2D2D2D"/>
<path d="M58.0858 15.9432V26.1354C57.0315 24.7935 54.9867 23.4516 51.9194 23.4516C47.5422 23.4516 43.9957 26.0076 43.9957 31.6628V38.5961C43.9957 44.2513 47.5422 46.8073 51.6958 46.8073C54.795 46.8073 56.9356 45.3057 58.2136 43.7721L59.9709 46.3281H62.6548V15.9752H58.0858V15.9432ZM48.5966 38.2127V31.9184C48.5966 29.2985 50.8012 27.669 52.9738 27.669C56.073 27.669 57.99 29.4263 57.99 31.9184V38.0849C58.0539 41.1202 55.9452 42.5579 53.0377 42.5579C50.8651 42.4621 48.5966 40.8965 48.5966 38.2127Z" fill="#2D2D2D"/>
<path d="M97.6404 15.9432H102.369V46.2961H97.6404V15.9432Z" fill="#2D2D2D"/>
<path d="M71.6647 23.867H66.936V46.2962H71.6647V23.867Z" fill="#2D2D2D"/>
<path d="M69.3323 21.1512C70.8146 21.1512 72.0162 19.9496 72.0162 18.4673C72.0162 16.9851 70.8146 15.7835 69.3323 15.7835C67.8501 15.7835 66.6485 16.9851 66.6485 18.4673C66.6485 19.9496 67.8501 21.1512 69.3323 21.1512Z" fill="#2D2D2D"/>
<path d="M115.405 42.4621C112.146 42.4621 110.58 40.7687 110.58 38.4363V36.5832H124.575V31.567C124.575 26.391 120.964 23.3557 115.373 23.3557C109.558 23.3557 105.82 26.6147 105.82 31.6948V38.628C105.82 43.804 109.558 46.8393 115.373 46.8393C119.686 46.8393 122.881 45.082 124.159 42.1106L120.772 40.0019C119.59 41.6314 117.865 42.4621 115.405 42.4621ZM110.58 31.6309C110.58 29.2985 112.21 27.669 115.245 27.669C118.28 27.669 119.91 29.2985 119.91 31.6309V33.0367H110.644L110.58 31.6309Z" fill="#2D2D2D"/>
<path d="M9.84072 23.3558C5.23986 23.3558 2.26848 25.2089 1.15021 27.9566L4.82451 30.2251C6.39008 27.733 7.85979 27.6052 9.84072 27.6052C12.7482 27.6052 14.0262 28.9471 14.0262 31.1517V32.909H10.0324C7.12494 32.909 0 33.8994 0 40.0658C0 44.443 3.32284 46.6476 7.34859 46.6476C10.5436 46.6476 12.876 45.146 14.2179 43.6123L16.071 46.1684H18.8188V30.8002C18.7549 26.5508 15.7835 23.3558 9.84072 23.3558ZM13.9943 39.1393C13.9304 39.4907 13.9304 39.9061 13.4831 40.4812C12.7802 41.4717 10.927 42.4621 8.81831 42.4621C6.54983 42.4621 4.92036 41.5356 4.92036 39.7144C4.92036 37.0306 9.23366 36.4555 11.9814 36.3277H14.0262L13.9943 39.1393Z" fill="#2D2D2D"/>
</g>
<defs>
<clipPath id="clip0">
<rect width="163.586" height="67" fill="white"/>
</clipPath>
</defs>
</svg>
