1 2.67104e-05 3.73858e-10 2.67104e-05 3.73858e-10 3.80874e-10
1.03753 2.77128e-05 4.02446e-10 2.67104e-05 3.73858e-10 3.95167e-10
1.07647 2.87528e-05 4.33219e-10 2.67104e-05 3.73858e-10 4.09997e-10
1.11686 2.98319e-05 4.66345e-10 2.67104e-05 3.73858e-10 4.25384e-10
1.15878 3.09514e-05 5.02004e-10 2.67104e-05 3.73858e-10 4.41348e-10
1.20226 3.2113e-05 5.4039e-10 2.67104e-05 3.73858e-10 4.57911e-10
1.24738 3.33181e-05 5.81711e-10 2.67104e-05 3.73858e-10 4.75095e-10
1.2942 3.45685e-05 6.26192e-10 2.67104e-05 3.73858e-10 4.92925e-10
1.34276 3.58658e-05 6.74073e-10 2.67104e-05 3.73858e-10 5.11424e-10
1.39316 3.72118e-05 7.25617e-10 2.67104e-05 3.73858e-10 5.30617e-10
1.44544 3.86083e-05 7.81101e-10 2.67104e-05 3.73858e-10 5.5053e-10
1.49968 4.00572e-05 8.40828e-10 2.67104e-05 3.73858e-10 5.7119e-10
1.55597 4.15605e-05 9.05122e-10 2.67104e-05 3.73858e-10 5.92626e-10
1.61436 4.31202e-05 9.74333e-10 2.67104e-05 3.73858e-10 6.14867e-10
1.67494 4.47384e-05 1.04884e-09 2.67104e-05 3.73858e-10 6.37942e-10
1.7378 4.64173e-05 1.12903e-09 2.67104e-05 3.73858e-10 6.61883e-10
1.80302 4.81593e-05 1.21537e-09 2.67104e-05 3.73858e-10 6.86722e-10
1.87068 4.99667e-05 1.3083e-09 2.67104e-05 3.73858e-10 7.12494e-10
1.94089 5.18418e-05 1.40834e-09 2.67104e-05 3.73858e-10 7.39232e-10
2.01372 5.37874e-05 1.51603e-09 2.67104e-05 3.73858e-10 7.66974e-10
2.0893 5.58059e-05 1.63195e-09 2.67104e-05 3.73858e-10 7.95758e-10
2.1677 5.79002e-05 1.75674e-09 2.67104e-05 3.73858e-10 8.25621e-10
2.24905 6.00731e-05 1.89107e-09 2.67104e-05 3.73858e-10 8.56606e-10
2.33346 6.23276e-05 2.03567e-09 2.67104e-05 3.73858e-10 8.88753e-10
2.42103 6.46666e-05 2.19133e-09 2.67104e-05 3.73858e-10 9.22106e-10
2.51189 6.70935e-05 2.35889e-09 2.67104e-05 3.73858e-10 9.56711e-10
2.60615 6.96114e-05 2.53926e-09 2.67104e-05 3.73858e-10 9.92615e-10
2.70396 7.22238e-05 2.73343e-09 2.67104e-05 3.73858e-10 1.02987e-09
2.80543 7.49342e-05 2.94244e-09 2.67104e-05 3.73858e-10 1.06852e-09
2.91072 7.77464e-05 3.16743e-09 2.67104e-05 3.73858e-10 1.10862e-09
3.01995 8.06641e-05 3.40963e-09 2.67104e-05 3.73858e-10 1.15022e-09
3.13329 8.36913e-05 3.67035e-09 2.67104e-05 3.73858e-10 1.19339e-09
3.25087 8.68321e-05 3.951e-09 2.67104e-05 3.73858e-10 1.23817e-09
3.37287 9.00908e-05 4.25312e-09 2.67104e-05 3.73858e-10 1.28464e-09
3.49945 9.34717e-05 4.57833e-09 2.67104e-05 3.73858e-10 1.33285e-09
3.63078 9.69796e-05 4.92841e-09 2.67104e-05 3.73858e-10 1.38287e-09
3.76704 0.000100619 5.30527e-09 2.67104e-05 3.73858e-10 1.43477e-09
3.90841 0.000104395 5.71094e-09 2.67104e-05 3.73858e-10 1.48861e-09
4.05509 0.000108313 6.14762e-09 2.67104e-05 3.73858e-10 1.54448e-09
4.20727 0.000112378 6.6177e-09 2.67104e-05 3.73858e-10 1.60244e-09
4.36516 0.000116595 7.12373e-09 2.67104e-05 3.73858e-10 1.66257e-09
4.52898 0.000120971 7.66844e-09 2.67104e-05 3.73858e-10 1.72497e-09
4.69894 0.000125511 8.25481e-09 2.67104e-05 3.73858e-10 1.7897e-09
4.87528 0.000130221 8.88602e-09 2.67104e-05 3.73858e-10 1.85687e-09
5.05825 0.000135108 9.56549e-09 2.67104e-05 3.73858e-10 1.92655e-09
5.24807 0.000140178 1.02969e-08 2.67104e-05 3.73858e-10 1.99885e-09
5.44503 0.000145439 1.10843e-08 2.67104e-05 3.73858e-10 2.07387e-09
5.64937 0.000150897 1.19318e-08 2.67104e-05 3.73858e-10 2.1517e-09
5.86138 0.00015656 1.28442e-08 2.67104e-05 3.73858e-10 2.23245e-09
6.08135 0.000162435 1.38263e-08 2.67104e-05 3.73858e-10 2.31623e-09
6.30957 0.000168531 1.48836e-08 2.67104e-05 3.73858e-10 2.40315e-09
6.54636 0.000174856 1.60216e-08 2.67104e-05 3.73858e-10 2.49334e-09
6.79204 0.000181418 1.72467e-08 2.67104e-05 3.73858e-10 2.58691e-09
7.04693 0.000188226 1.85655e-08 2.67104e-05 3.73858e-10 2.68399e-09
7.31139 0.00019529 1.99851e-08 2.67104e-05 3.73858e-10 2.78472e-09
7.58578 0.000202619 2.15133e-08 2.67104e-05 3.73858e-10 2.88922e-09
7.87046 0.000210223 2.31583e-08 2.67104e-05 3.73858e-10 2.99765e-09
8.16582 0.000218112 2.49291e-08 2.67104e-05 3.73858e-10 3.11015e-09
8.47227 0.000226298 2.68353e-08 2.67104e-05 3.73858e-10 3.22687e-09
8.79023 0.00023479 2.88873e-08 2.67104e-05 3.73858e-10 3.34797e-09
9.12011 0.000243602 3.10962e-08 2.67104e-05 3.73858e-10 3.47361e-09
9.46237 0.000252744 3.3474e-08 2.67104e-05 3.73858e-10 3.60397e-09
9.81748 0.000262229 3.60336e-08 2.67104e-05 3.73858e-10 3.73922e-09
10.1859 0.00027207 3.87889e-08 2.67104e-05 3.73858e-10 3.87955e-09
10.5682 0.00028228 4.17549e-08 2.67104e-05 3.73858e-10 4.02514e-09
10.9648 0.000292874 4.49477e-08 2.67104e-05 3.73858e-10 4.1762e-09
11.3763 0.000303865 4.83846e-08 2.67104e-05 3.73858e-10 4.33292e-09
11.8032 0.000315268 5.20843e-08 2.67104e-05 3.73858e-10 4.49553e-09
12.2462 0.0003271 5.6067e-08 2.67104e-05 3.73858e-10 4.66424e-09
12.7057 0.000339375 6.03542e-08 2.67104e-05 3.73858e-10 4.83928e-09
13.1826 0.000352112 6.49692e-08 2.67104e-05 3.73858e-10 5.02089e-09
13.6773 0.000365326 6.9937e-08 2.67104e-05 3.73858e-10 5.20932e-09
14.1906 0.000379036 7.52848e-08 2.67104e-05 3.73858e-10 5.40482e-09
14.7231 0.00039326 8.10415e-08 2.67104e-05 3.73858e-10 5.60765e-09
15.2757 0.000408019 8.72383e-08 2.67104e-05 3.73858e-10 5.8181e-09
15.8489 0.000423331 9.3909e-08 2.67104e-05 3.73858e-10 6.03644e-09
16.4437 0.000439218 1.0109e-07 2.67104e-05 3.73858e-10 6.26298e-09
17.0608 0.000455701 1.0882e-07 2.67104e-05 3.73858e-10 6.49802e-09
17.7011 0.000472803 1.17141e-07 2.67104e-05 3.73858e-10 6.74188e-09
18.3654 0.000490547 1.26098e-07 2.67104e-05 3.73858e-10 6.99489e-09
19.0546 0.000508956 1.3574e-07 2.67104e-05 3.73858e-10 7.2574e-09
19.7697 0.000528056 1.46119e-07 2.67104e-05 3.73858e-10 7.52976e-09
20.5116 0.000547874 1.57292e-07 2.67104e-05 3.73858e-10 7.81234e-09
21.2814 0.000568434 1.6932e-07 2.67104e-05 3.73858e-10 8.10552e-09
22.08 0.000589767 1.82267e-07 2.67104e-05 3.73858e-10 8.40971e-09
22.9087 0.0006119 1.96204e-07 2.67104e-05 3.73858e-10 8.72531e-09
23.7684 0.000634863 2.11206e-07 2.67104e-05 3.73858e-10 9.05276e-09
24.6604 0.000658689 2.27356e-07 2.67104e-05 3.73858e-10 9.39249e-09
25.5859 0.000683408 2.44741e-07 2.67104e-05 3.73858e-10 9.74498e-09
26.5461 0.000709056 2.63455e-07 2.67104e-05 3.73858e-10 1.01107e-08
27.5423 0.000735665 2.83601e-07 2.67104e-05 3.73858e-10 1.04901e-08
28.5759 0.000763274 3.05286e-07 2.67104e-05 3.73858e-10 1.08838e-08
29.6483 0.000791918 3.2863e-07 2.67104e-05 3.73858e-10 1.12923e-08
30.761 0.000821638 3.53759e-07 2.67104e-05 3.73858e-10 1.1716e-08
31.9154 0.000852472 3.80809e-07 2.67104e-05 3.73858e-10 1.21557e-08
33.1131 0.000884464 4.09928e-07 2.67104e-05 3.73858e-10 1.26119e-08
34.3558 0.000917657 4.41273e-07 2.67104e-05 3.73858e-10 1.30852e-08
35.6451 0.000952095 4.75015e-07 2.67104e-05 3.73858e-10 1.35763e-08
36.9828 0.000987826 5.11337e-07 2.67104e-05 3.73858e-10 1.40858e-08
38.3707 0.0010249 5.50437e-07 2.67104e-05 3.73858e-10 1.46144e-08
39.8107 0.00106336 5.92526e-07 2.67104e-05 3.73858e-10 1.51629e-08
41.3048 0.00110327 6.37833e-07 2.67104e-05 3.73858e-10 1.57319e-08
42.8549 0.00114467 6.86605e-07 2.67104e-05 3.73858e-10 1.63223e-08
44.4631 0.00118763 7.39107e-07 2.67104e-05 3.73858e-10 1.69348e-08
46.1318 0.0012322 7.95623e-07 2.67104e-05 3.73858e-10 1.75704e-08
47.863 0.00127844 8.5646e-07 2.67104e-05 3.73858e-10 1.82298e-08
49.6592 0.00132642 9.2195e-07 2.67104e-05 3.73858e-10 1.89139e-08
51.5229 0.0013762 9.92447e-07 2.67104e-05 3.73858e-10 1.96237e-08
53.4564 0.00142784 1.06833e-06 2.67104e-05 3.73858e-10 2.03601e-08
55.4626 0.00148143 1.15002e-06 2.67104e-05 3.73858e-10 2.11242e-08
57.544 0.00153702 1.23796e-06 2.67104e-05 3.73858e-10 2.1917e-08
59.7035 0.0015947 1.33262e-06 2.67104e-05 3.73858e-10 2.27395e-08
61.9441 0.00165455 1.43452e-06 2.67104e-05 3.73858e-10 2.35929e-08
64.2688 0.00171664 1.54421e-06 2.67104e-05 3.73858e-10 2.44783e-08
66.6807 0.00178107 1.66229e-06 2.67104e-05 3.73858e-10 2.53969e-08
69.1831 0.00184791 1.7894e-06 2.67104e-05 3.73858e-10 2.635e-08
71.7794 0.00191726 1.92623e-06 2.67104e-05 3.73858e-10 2.73389e-08
74.4732 0.00198921 2.07352e-06 2.67104e-05 3.73858e-10 2.83649e-08
77.2681 0.00206386 2.23207e-06 2.67104e-05 3.73858e-10 2.94294e-08
80.1678 0.00214131 2.40274e-06 2.67104e-05 3.73858e-10 3.05338e-08
83.1764 0.00222167 2.58647e-06 2.67104e-05 3.73858e-10 3.16797e-08
86.2979 0.00230505 2.78424e-06 2.67104e-05 3.73858e-10 3.28686e-08
89.5365 0.00239155 2.99714e-06 2.67104e-05 3.73858e-10 3.41021e-08
92.8966 0.00248131 3.22632e-06 2.67104e-05 3.73858e-10 3.53819e-08
96.3829 0.00257443 3.47302e-06 2.67104e-05 3.73858e-10 3.67097e-08
100 0.00267104 3.73858e-06 2.67104e-05 3.73858e-10 3.80874e-08
103.753 0.00277128 4.02446e-06 2.67104e-05 3.73858e-10 3.95167e-08
107.647 0.00287528 4.33219e-06 2.67104e-05 3.73858e-10 4.09997e-08
111.686 0.00298319 4.66345e-06 2.67104e-05 3.73858e-10 4.25384e-08
115.878 0.00309514 5.02004e-06 2.67104e-05 3.73858e-10 4.41348e-08
120.226 0.0032113 5.4039e-06 2.67104e-05 3.73858e-10 4.57911e-08
124.738 0.00333181 5.81711e-06 2.67104e-05 3.73858e-10 4.75095e-08
129.42 0.00345685 6.26192e-06 2.67104e-05 3.73858e-10 4.92925e-08
134.276 0.00358658 6.74073e-06 2.67104e-05 3.73858e-10 5.11424e-08
139.316 0.00372118 7.25617e-06 2.67104e-05 3.73858e-10 5.30617e-08
144.544 0.00386083 7.81101e-06 2.67104e-05 3.73858e-10 5.5053e-08
149.968 0.00400572 8.40828e-06 2.67104e-05 3.73858e-10 5.7119e-08
155.597 0.00415605 9.05122e-06 2.67104e-05 3.73858e-10 5.92626e-08
161.436 0.00431202 9.74333e-06 2.67104e-05 3.73858e-10 6.14867e-08
167.494 0.00447384 1.04884e-05 2.67104e-05 3.73858e-10 6.37942e-08
173.78 0.00464173 1.12903e-05 2.67104e-05 3.73858e-10 6.61883e-08
180.302 0.00481593 1.21537e-05 2.67104e-05 3.73858e-10 6.86722e-08
187.068 0.00499667 1.3083e-05 2.67104e-05 3.73858e-10 7.12494e-08
194.089 0.00518418 1.40834e-05 2.67104e-05 3.73858e-10 7.39232e-08
201.372 0.00537874 1.51603e-05 2.67104e-05 3.73858e-10 7.66974e-08
208.93 0.00558059 1.63195e-05 2.67104e-05 3.73858e-10 7.95758e-08
216.77 0.00579002 1.75674e-05 2.67104e-05 3.73858e-10 8.25621e-08
224.905 0.00600731 1.89107e-05 2.67104e-05 3.73858e-10 8.56606e-08
233.346 0.00623276 2.03567e-05 2.67104e-05 3.73858e-10 8.88753e-08
242.103 0.00646666 2.19133e-05 2.67104e-05 3.73858e-10 9.22106e-08
251.189 0.00670935 2.35889e-05 2.67104e-05 3.73858e-10 9.56711e-08
260.615 0.00696114 2.53926e-05 2.67104e-05 3.73858e-10 9.92615e-08
270.396 0.00722238 2.73343e-05 2.67104e-05 3.73858e-10 1.02987e-07
280.543 0.00749342 2.94244e-05 2.67104e-05 3.73858e-10 1.06852e-07
291.072 0.00777464 3.16743e-05 2.67104e-05 3.73858e-10 1.10862e-07
301.995 0.00806641 3.40963e-05 2.67104e-05 3.73858e-10 1.15022e-07
313.329 0.00836913 3.67035e-05 2.67104e-05 3.73858e-10 1.19339e-07
325.087 0.00868321 3.951e-05 2.67104e-05 3.73858e-10 1.23817e-07
337.287 0.00900908 4.25312e-05 2.67104e-05 3.73858e-10 1.28464e-07
349.945 0.00934717 4.57833e-05 2.67104e-05 3.73858e-10 1.33285e-07
363.078 0.00969796 4.92841e-05 2.67104e-05 3.73858e-10 1.38287e-07
376.704 0.0100619 5.30527e-05 2.67104e-05 3.73858e-10 1.43477e-07
390.841 0.0104395 5.71094e-05 2.67104e-05 3.73858e-10 1.48861e-07
405.509 0.0108313 6.14762e-05 2.67104e-05 3.73858e-10 1.54448e-07
420.727 0.0112378 6.6177e-05 2.67104e-05 3.73858e-10 1.60244e-07
436.516 0.0116595 7.12373e-05 2.67104e-05 3.73858e-10 1.66257e-07
452.898 0.0120971 7.66844e-05 2.67104e-05 3.73858e-10 1.72497e-07
469.894 0.0125511 8.25481e-05 2.67104e-05 3.73858e-10 1.7897e-07
487.528 0.0130221 8.88602e-05 2.67104e-05 3.73858e-10 1.85687e-07
505.825 0.0135108 9.56549e-05 2.67104e-05 3.73858e-10 1.92655e-07
524.807 0.0140178 0.000102969 2.67104e-05 3.73858e-10 1.99885e-07
544.503 0.0145439 0.000110843 2.67104e-05 3.73858e-10 2.07387e-07
564.937 0.0150897 0.000119318 2.67104e-05 3.73858e-10 2.1517e-07
586.138 0.015656 0.000128442 2.67104e-05 3.73858e-10 2.23245e-07
608.135 0.0162435 0.000138263 2.67104e-05 3.73858e-10 2.31623e-07
630.957 0.0168531 0.000148836 2.67104e-05 3.73858e-10 2.40315e-07
654.636 0.0174856 0.000160216 2.67104e-05 3.73858e-10 2.49334e-07
679.204 0.0181418 0.000172467 2.67104e-05 3.73858e-10 2.58691e-07
704.693 0.0188226 0.000185655 2.67104e-05 3.73858e-10 2.68399e-07
731.139 0.019529 0.000199851 2.67104e-05 3.73858e-10 2.78472e-07
758.578 0.0202619 0.000215133 2.67104e-05 3.73858e-10 2.88922e-07
787.046 0.0210223 0.000231583 2.67104e-05 3.73858e-10 2.99765e-07
816.582 0.0218112 0.000249291 2.67104e-05 3.73858e-10 3.11015e-07
847.227 0.0226298 0.000268353 2.67104e-05 3.73858e-10 3.22687e-07
879.023 0.023479 0.000288873 2.67104e-05 3.73858e-10 3.34797e-07
912.011 0.0243602 0.000310962 2.67104e-05 3.73858e-10 3.47361e-07
946.237 0.0252744 0.00033474 2.67104e-05 3.73858e-10 3.60397e-07
981.748 0.0262229 0.000360336 2.67104e-05 3.73858e-10 3.73922e-07
1018.59 0.027207 0.000387889 2.67104e-05 3.73858e-10 3.87955e-07
1056.82 0.028228 0.000417549 2.67104e-05 3.73858e-10 4.02514e-07
1096.48 0.0292874 0.000449477 2.67104e-05 3.73858e-10 4.1762e-07
1137.63 0.0303865 0.000483846 2.67104e-05 3.73858e-10 4.33292e-07
1180.32 0.0315268 0.000520843 2.67104e-05 3.73858e-10 4.49553e-07
1224.62 0.03271 0.00056067 2.67104e-05 3.73858e-10 4.66424e-07
1270.57 0.0339375 0.000603542 2.67104e-05 3.73858e-10 4.83928e-07
1318.26 0.0352112 0.000649692 2.67104e-05 3.73858e-10 5.02089e-07
1367.73 0.0365326 0.00069937 2.67104e-05 3.73858e-10 5.20932e-07
1419.06 0.0379036 0.000752848 2.67104e-05 3.73858e-10 5.40482e-07
1472.31 0.039326 0.000810415 2.67104e-05 3.73858e-10 5.60765e-07
1527.57 0.0408019 0.000872383 2.67104e-05 3.73858e-10 5.8181e-07
1584.89 0.0423331 0.00093909 2.67104e-05 3.73858e-10 6.03644e-07
1644.37 0.0439218 0.0010109 2.67104e-05 3.73858e-10 6.26298e-07
1706.08 0.0455701 0.0010882 2.67104e-05 3.73858e-10 6.49802e-07
1770.11 0.0472803 0.00117141 2.67104e-05 3.73858e-10 6.74188e-07
1836.54 0.0490547 0.00126098 2.67104e-05 3.73858e-10 6.99489e-07
1905.46 0.0508956 0.0013574 2.67104e-05 3.73858e-10 7.2574e-07
1976.97 0.0528056 0.00146119 2.67104e-05 3.73858e-10 7.52976e-07
2051.16 0.0547874 0.00157292 2.67104e-05 3.73858e-10 7.81234e-07
2128.14 0.0568434 0.0016932 2.67104e-05 3.73858e-10 8.10552e-07
2208 0.0589767 0.00182267 2.67104e-05 3.73858e-10 8.40971e-07
2290.87 0.06119 0.00196204 2.67104e-05 3.73858e-10 8.72531e-07
2376.84 0.0634863 0.00211206 2.67104e-05 3.73858e-10 9.05276e-07
2466.04 0.0658689 0.00227356 2.67104e-05 3.73858e-10 9.39249e-07
2558.59 0.0683408 0.00244741 2.67104e-05 3.73858e-10 9.74498e-07
2654.61 0.0709056 0.00263455 2.67104e-05 3.73858e-10 1.01107e-06
2754.23 0.0735665 0.00283601 2.67104e-05 3.73858e-10 1.04901e-06
2857.59 0.0763274 0.00305286 2.67104e-05 3.73858e-10 1.08838e-06
2964.83 0.0791918 0.0032863 2.67104e-05 3.73858e-10 1.12923e-06
3076.1 0.0821638 0.00353759 2.67104e-05 3.73858e-10 1.1716e-06
3191.54 0.0852472 0.00380809 2.67104e-05 3.73858e-10 1.21557e-06
3311.31 0.0884464 0.00409928 2.67104e-05 3.73858e-10 1.26119e-06
3435.58 0.0917657 0.00441273 2.67104e-05 3.73858e-10 1.30852e-06
3564.51 0.0952095 0.00475015 2.67104e-05 3.73858e-10 1.35763e-06
3698.28 0.0987826 0.00511337 2.67104e-05 3.73858e-10 1.40858e-06
3837.07 0.10249 0.00550437 2.67104e-05 3.73858e-10 1.46144e-06
3981.07 0.106336 0.00592526 2.67104e-05 3.73858e-10 1.51629e-06
4130.48 0.110327 0.00637833 2.67104e-05 3.73858e-10 1.57319e-06
4285.49 0.114467 0.00686605 2.67104e-05 3.73858e-10 1.63223e-06
4446.31 0.118763 0.00739107 2.67104e-05 3.73858e-10 1.69348e-06
4613.18 0.12322 0.00795623 2.67104e-05 3.73858e-10 1.75704e-06
4786.3 0.127844 0.0085646 2.67104e-05 3.73858e-10 1.82298e-06
4965.92 0.132642 0.0092195 2.67104e-05 3.73858e-10 1.89139e-06
5152.29 0.13762 0.00992447 2.67104e-05 3.73858e-10 1.96237e-06
5345.64 0.142784 0.0106833 2.67104e-05 3.73858e-10 2.03601e-06
5546.26 0.148143 0.0115002 2.67104e-05 3.73858e-10 2.11242e-06
5754.4 0.153702 0.0123796 2.67104e-05 3.73858e-10 2.1917e-06
5970.35 0.15947 0.0133262 2.67104e-05 3.73858e-10 2.27395e-06
6194.41 0.165455 0.0143452 2.67104e-05 3.73858e-10 2.35929e-06
6426.88 0.171664 0.0154421 2.67104e-05 3.73858e-10 2.44783e-06
6668.07 0.178107 0.0166229 2.67104e-05 3.73858e-10 2.53969e-06
6918.31 0.184791 0.017894 2.67104e-05 3.73858e-10 2.635e-06
7177.94 0.191726 0.0192623 2.67104e-05 3.73858e-10 2.73389e-06
7447.32 0.198921 0.0207352 2.67104e-05 3.73858e-10 2.83649e-06
7726.81 0.206386 0.0223207 2.67104e-05 3.73858e-10 2.94294e-06
8016.78 0.214131 0.0240274 2.67104e-05 3.73858e-10 3.05338e-06
8317.64 0.222167 0.0258647 2.67104e-05 3.73858e-10 3.16797e-06
8629.79 0.230505 0.0278424 2.67104e-05 3.73858e-10 3.28686e-06
8953.65 0.239155 0.0299714 2.67104e-05 3.73858e-10 3.41021e-06
9289.66 0.248131 0.0322632 2.67104e-05 3.73858e-10 3.53819e-06
9638.29 0.257443 0.0347302 2.67104e-05 3.73858e-10 3.67097e-06
10000 0.267104 0.0373858 2.67104e-05 3.73858e-10 3.80874e-06
10375.3 0.277128 0.0402446 2.67104e-05 3.73858e-10 3.95167e-06
10764.7 0.287528 0.0433219 2.67104e-05 3.73858e-10 4.09997e-06
11168.6 0.298319 0.0466345 2.67104e-05 3.73858e-10 4.25373e-06
11587.8 0.309514 0.0502003 2.67103e-05 3.73821e-10 4.41324e-06
12022.6 0.32113 0.0540387 2.67103e-05 3.73821e-10 4.57886e-06
12473.8 0.333181 0.0581706 2.67103e-05 3.73821e-10 4.75069e-06
12942 0.345685 0.0626184 2.67103e-05 3.73821e-10 4.92832e-06
13427.6 0.358658 0.0674057 2.67099e-05 3.73684e-10 5.113e-06
13931.6 0.372117 0.0725587 2.67103e-05 3.73823e-10 5.30565e-06
14454.4 0.386082 0.0781066 2.67103e-05 3.73823e-10 5.50384e-06
14996.8 0.400571 0.0840778 2.6709e-05 3.73485e-10 5.70785e-06
15559.7 0.415603 0.0905026 2.67083e-05 3.7333e-10 5.92147e-06
16143.6 0.431199 0.0974181 2.67085e-05 3.73423e-10 6.14186e-06
16749.4 0.44738 0.10486 2.67065e-05 3.7295e-10 6.36707e-06
17378 0.464166 0.112864 2.67051e-05 3.72654e-10 6.60306e-06
18030.2 0.481582 0.121477 2.67037e-05 3.72394e-10 6.84663e-06
18706.8 0.49965 0.130743 2.67017e-05 3.72046e-10 7.09766e-06
19408.9 0.518395 0.140708 2.66979e-05 3.7142e-10 7.35133e-06
20137.2 0.537839 0.151417 2.66919e-05 3.70386e-10 7.61406e-06
20893 0.558008 0.162926 2.66855e-05 3.69333e-10 7.8839e-06
21677 0.57893 0.175289 2.66781e-05 3.68118e-10 8.16072e-06
22490.5 0.600629 0.188566 2.66705e-05 3.67117e-10 8.44944e-06
23334.6 0.623137 0.20283 2.66639e-05 3.66042e-10 8.74456e-06
24210.3 0.646482 0.218145 2.66541e-05 3.64814e-10 9.04566e-06
25118.9 0.670693 0.234582 2.66417e-05 3.63239e-10 9.3581e-06
26061.5 0.695801 0.252226 2.66275e-05 3.61784e-10 9.68308e-06
27039.6 0.72184 0.271167 2.66187e-05 3.61057e-10 1.00168e-05
28054.3 0.748842 0.291496 2.66002e-05 3.5935e-10 1.03514e-05
29107.2 0.776839 0.313292 2.65821e-05 3.5757e-10 1.07071e-05
30199.5 0.80587 0.336684 2.65721e-05 3.56976e-10 1.10769e-05
31332.9 0.835975 0.361792 2.65554e-05 3.56021e-10 1.14584e-05
32508.7 0.867191 0.388739 2.65416e-05 3.55389e-10 1.18529e-05
33728.7 0.899558 0.41766 2.65205e-05 3.54304e-10 1.22463e-05
34994.5 0.933109 0.448662 2.64964e-05 3.52774e-10 1.26543e-05
36307.8 0.967887 0.4819 2.64671e-05 3.50897e-10 1.30694e-05
37670.4 1.00393 0.517516 2.64444e-05 3.49909e-10 1.35148e-05
39084.1 1.0413 0.555728 2.64218e-05 3.49706e-10 1.39691e-05
40550.9 1.08003 0.596707 2.63898e-05 3.48123e-10 1.44226e-05
42072.7 1.12017 0.640604 2.63532e-05 3.46547e-10 1.48913e-05
43651.6 1.16174 0.687628 2.63187e-05 3.45172e-10 1.53753e-05
45289.8 1.20483 0.738003 2.62792e-05 3.43545e-10 1.58791e-05
46989.4 1.24947 0.791981 2.62438e-05 3.42722e-10 1.63859e-05
48752.8 1.29571 0.849772 2.62073e-05 3.41206e-10 1.69205e-05
50582.5 1.34363 0.911688 2.61707e-05 3.40334e-10 1.74833e-05
52480.7 1.39328 0.978064 2.61409e-05 3.39803e-10 1.80468e-05
54450.3 1.44472 1.04915 2.61017e-05 3.38906e-10 1.86331e-05
56493.7 1.49801 1.1253 2.60555e-05 3.37681e-10 1.92339e-05
58613.8 1.55322 1.20686 2.60189e-05 3.37557e-10 1.98625e-05
60813.5 1.6104 1.29424 2.59694e-05 3.36071e-10 2.0487e-05
63095.7 1.66961 1.38775 2.59186e-05 3.34498e-10 2.11254e-05
65463.6 1.73093 1.4878 2.58732e-05 3.33531e-10 2.18144e-05
67920.4 1.79444 1.59498 2.58327e-05 3.33517e-10 2.25369e-05
70469.3 1.86023 1.70987 2.57917e-05 3.33011e-10 2.32623e-05
73113.9 1.92837 1.83291 2.57426e-05 3.32191e-10 2.40202e-05
75857.8 1.99895 1.96473 2.57064e-05 3.32227e-10 2.47975e-05
78704.6 2.07206 2.10592 2.56556e-05 3.30995e-10 2.55883e-05
81658.2 2.14776 2.25707 2.56056e-05 3.30297e-10 2.64099e-05
84722.7 2.22615 2.41894 2.55499e-05 3.28631e-10 2.72096e-05
87902.3 2.30731 2.59197 2.54979e-05 3.27325e-10 2.80434e-05
91201.1 2.39133 2.77699 2.54457e-05 3.2651e-10 2.89358e-05
94623.7 2.47834 2.97506 2.5399e-05 3.25584e-10 2.98433e-05
98174.8 2.56846 3.18701 2.5357e-05 3.24856e-10 3.07663e-05
101859 2.66178 3.41372 2.53095e-05 3.23078e-10 3.17113e-05
105682 2.75846 3.65616 2.5269e-05 3.22344e-10 3.27062e-05
109648 2.85859 3.91559 2.52243e-05 3.22194e-10 3.37262e-05
113763 2.9623 4.19315 2.51857e-05 3.21822e-10 3.47729e-05
118032 3.06974 4.49007 2.51439e-05 3.2079e-10 3.58355e-05
122462 3.18102 4.80754 2.51006e-05 3.20417e-10 3.69032e-05
127057 3.29626 5.14674 2.50457e-05 3.18603e-10 3.79796e-05
131826 3.41554 5.50893 2.49929e-05 3.17268e-10 3.91256e-05
136773 3.53906 5.89605 2.49371e-05 3.15921e-10 4.02599e-05
141906 3.66688 6.30935 2.48767e-05 3.14184e-10 4.14515e-05
147231 3.79922 6.75085 2.48243e-05 3.1328e-10 4.26283e-05
152757 3.93617 7.22193 2.47429e-05 3.10867e-10 4.38479e-05
158489 4.07789 7.72466 2.46938e-05 3.10281e-10 4.51218e-05
164437 4.22459 8.26142 2.46335e-05 3.09226e-10 4.64192e-05
170608 4.37638 8.83433 2.45681e-05 3.08567e-10 4.77925e-05
177011 4.53348 9.44633 2.45018e-05 3.07469e-10 4.90975e-05
183654 4.69598 10.0986 2.44235e-05 3.05165e-10 5.04174e-05
190546 4.86406 10.7936 2.43556e-05 3.03515e-10 5.18016e-05
197697 5.03799 11.5345 2.42943e-05 3.02846e-10 5.33347e-05
205116 5.218 12.3259 2.42189e-05 3.01567e-10 5.47676e-05
212814 5.40418 13.169 2.41609e-05 3.00381e-10 5.62906e-05
220800 5.5969 14.0682 2.40946e-05 2.98421e-10 5.77892e-05
229087 5.79633 15.0259 2.40317e-05 2.9642e-10 5.92545e-05
237684 6.00252 16.0447 2.39365e-05 2.94717e-10 6.07786e-05
246604 6.21567 17.129 2.38472e-05 2.92137e-10 6.21631e-05
255859 6.43582 18.2796 2.37506e-05 2.90597e-10 6.38894e-05
265461 6.66358 19.5065 2.3693e-05 2.91356e-10 6.56422e-05
275423 6.89917 20.8144 2.36187e-05 2.90867e-10 6.74565e-05
285759 7.14295 22.2089 2.35448e-05 2.89077e-10 6.92457e-05
296483 7.39503 23.6941 2.34678e-05 2.88536e-10 7.10152e-05
307610 7.65569 25.2744 2.33825e-05 2.86508e-10 7.28538e-05
319154 7.92517 26.9565 2.32928e-05 2.84741e-10 7.45601e-05
331131 8.20368 28.7426 2.32027e-05 2.81836e-10 7.62184e-05
343558 8.49136 30.6369 2.30946e-05 2.79779e-10 7.78435e-05
356451 8.78836 32.6442 2.29859e-05 2.77004e-10 7.96477e-05
369828 9.09527 34.7751 2.28967e-05 2.75661e-10 8.15368e-05
383707 9.41241 37.0384 2.27998e-05 2.74482e-10 8.33854e-05
398107 9.74009 39.4399 2.27094e-05 2.72512e-10 8.5223e-05
413048 10.0787 41.9864 2.26214e-05 2.70469e-10 8.72159e-05
428549 10.4286 44.6902 2.25181e-05 2.69095e-10 8.8835e-05
444631 10.7898 47.5477 2.24038e-05 2.66084e-10 9.07772e-05
461318 11.1629 50.5771 2.23211e-05 2.65768e-10 9.29389e-05
478630 11.5485 53.7952 2.22251e-05 2.64357e-10 9.49131e-05
496592 11.9468 57.2049 2.21275e-05 2.63737e-10 9.70657e-05
515229 12.3581 60.8228 2.20147e-05 2.61633e-10 9.92103e-05
534564 12.7828 64.6594 2.1912e-05 2.59901e-10 0.000101433
554626 13.2213 68.7291 2.18123e-05 2.59266e-10 0.00010384
575440 13.6745 73.0518 2.17256e-05 2.59559e-10 0.00010613
597035 14.1425 77.6357 2.16135e-05 2.56218e-10 0.000108115
619441 14.6253 82.4805 2.1484e-05 2.5434e-10 0.000110267
642688 15.1236 87.6071 2.13865e-05 2.52963e-10 0.000112403
666807 15.6384 93.0292 2.1284e-05 2.51606e-10 0.000114344
691831 16.1693 98.752 2.11623e-05 2.49308e-10 0.000116747
717794 16.7175 104.814 2.10605e-05 2.50149e-10 0.00011908
744732 17.2834 111.23 2.09492e-05 2.47397e-10 0.000121176
772681 17.8673 118.003 2.0827e-05 2.4526e-10 0.000123227
801678 18.4691 125.15 2.06931e-05 2.43525e-10 0.000125496
831764 19.0893 132.701 2.05399e-05 2.40874e-10 0.000127451
862979 19.7286 140.658 2.04407e-05 2.39603e-10 0.000129832
895365 20.3884 149.067 2.03229e-05 2.39562e-10 0.000132468
928966 21.0693 157.97 2.02128e-05 2.38956e-10 0.000135017
963829 21.7717 167.384 2.00779e-05 2.3564e-10 0.000137592
1e+06 22.4962 177.337 1.99724e-05 2.34867e-10 0.00014028
1.03753e+06 23.2437 187.866 1.98711e-05 2.33317e-10 0.000142688
1.07647e+06 24.015 198.978 1.97452e-05 2.32792e-10 0.00014494
1.11686e+06 24.8101 210.689 1.96119e-05 2.30193e-10 0.000146891
1.15878e+06 25.6295 223.002 1.94987e-05 2.29056e-10 0.00014951
1.20226e+06 26.475 236.006 1.93785e-05 2.27835e-10 0.000151943
1.24738e+06 27.3464 249.717 1.92472e-05 2.25543e-10 0.000154474
1.2942e+06 28.245 264.179 1.9133e-05 2.24742e-10 0.000157279
1.34276e+06 29.172 279.457 1.90429e-05 2.24391e-10 0.000160092
1.39316e+06 30.1287 295.592 1.89266e-05 2.22223e-10 0.000162689
1.44544e+06 31.1154 312.603 1.88146e-05 2.22211e-10 0.000164804
1.49968e+06 32.132 330.483 1.86618e-05 2.19277e-10 0.000167188
1.55597e+06 33.1799 349.302 1.85716e-05 2.19764e-10 0.000169411
1.61436e+06 34.2593 369.087 1.84092e-05 2.15905e-10 0.00017144
1.67494e+06 35.3701 389.86 1.826e-05 2.12999e-10 0.000173316
1.7378e+06 36.5142 411.649 1.81277e-05 2.1096e-10 0.000175408
1.80302e+06 37.6936 434.528 1.80438e-05 2.12336e-10 0.000177798
1.87068e+06 38.9093 458.589 1.79082e-05 2.10785e-10 0.000180564
1.94089e+06 40.1623 483.941 1.77735e-05 2.08671e-10 0.000183166
2.01372e+06 41.4528 510.624 1.76655e-05 2.08739e-10 0.00018601
2.0893e+06 42.7846 538.739 1.75723e-05 2.08912e-10 0.000188464
2.1677e+06 44.1584 568.293 1.74578e-05 2.06241e-10 0.000191333
2.24905e+06 45.5759 599.423 1.7371e-05 2.06392e-10 0.000194768
2.33346e+06 47.0385 632.301 1.72615e-05 2.07484e-10 0.000198091
2.42103e+06 48.5456 666.995 1.71516e-05 2.07152e-10 0.00020151
2.51189e+06 50.0986 703.612 1.70337e-05 2.0648e-10 0.000204009
2.60615e+06 51.6995 742.075 1.69272e-05 2.06211e-10 0.000206927
2.70396e+06 53.349 782.552 1.68032e-05 2.04544e-10 0.000210792
2.80543e+06 55.0476 825.332 1.66924e-05 2.03547e-10 0.000214841
2.91072e+06 56.8008 870.571 1.65885e-05 2.01977e-10 0.000217213
3.01995e+06 58.6069 918.025 1.65013e-05 2.01683e-10 0.000221318
3.13329e+06 60.4708 968.191 1.63966e-05 2.00654e-10 0.000225353
3.25087e+06 62.3952 1021.19 1.63134e-05 2.0202e-10 0.00022867
3.37287e+06 64.3783 1076.98 1.61922e-05 1.97302e-10 0.000232009
3.49945e+06 66.4248 1135.72 1.61135e-05 1.99938e-10 0.00023639
3.63078e+06 68.5361 1197.81 1.60311e-05 2.01421e-10 0.000239534
3.76704e+06 70.7145 1263.08 1.59384e-05 1.98501e-10 0.000242757
3.90841e+06 72.9623 1331.72 1.58335e-05 1.96646e-10 0.000246529
4.05509e+06 75.2773 1404.04 1.57498e-05 1.97214e-10 0.000249177
4.20727e+06 77.6666 1479.88 1.56648e-05 1.98784e-10 0.000252893
4.36516e+06 80.1304 1559.74 1.55711e-05 1.97736e-10 0.000255722
4.52898e+06 82.6689 1643.53 1.54448e-05 1.93925e-10 0.000259696
4.69894e+06 85.2856 1731.8 1.53455e-05 1.94169e-10 0.000262629
4.87528e+06 87.9835 1824.43 1.52673e-05 1.91973e-10 0.000266793
5.05825e+06 90.7722 1922.06 1.52176e-05 1.92546e-10 0.000270891
5.24807e+06 93.6553 2024.9 1.51546e-05 1.94674e-10 0.000274864
5.44503e+06 96.6248 2133.17 1.50111e-05 1.89788e-10 0.000279417
5.64937e+06 99.6862 2247.36 1.49555e-05 1.90859e-10 0.000284781
5.86138e+06 102.852 2368.12 1.49061e-05 1.92307e-10 0.000289699
6.08135e+06 106.12 2495.57 1.48214e-05 1.92213e-10 0.000296042
6.30957e+06 109.501 2630.7 1.47879e-05 1.92566e-10 0.000301721
6.54636e+06 112.995 2773.58 1.47081e-05 1.91965e-10 0.000306085
6.79204e+06 116.596 2923.98 1.46073e-05 1.89558e-10 0.000308334
7.04693e+06 120.311 3081.16 1.45558e-05 1.8779e-10 0.000311657
7.31139e+06 124.154 3246 1.44953e-05 1.90172e-10 0.000317656
7.58578e+06 128.12 3420.32 1.44324e-05 1.89911e-10 0.000323044
7.87046e+06 132.218 3604.25 1.43897e-05 1.92353e-10 0.000328989
8.16582e+06 136.456 3798.6 1.42931e-05 1.89527e-10 0.000334318
8.47227e+06 140.833 4003.5 1.42663e-05 1.89053e-10 0.000339512
8.79023e+06 145.365 4219.4 1.42102e-05 1.8641e-10 0.000342911
9.12011e+06 150.046 4445.64 1.41667e-05 1.89327e-10 0.000347979
9.46237e+06 154.886 4683.84 1.41166e-05 1.89338e-10 0.00035411
9.81748e+06 159.88 4935.33 1.39919e-05 1.86148e-10 0.000358711
1.01859e+07 165.037 5199.66 1.39518e-05 1.85378e-10 0.000365701
1.05682e+07 170.373 5479.24 1.39506e-05 1.8893e-10 0.000369835
1.09648e+07 175.888 5772.6 1.3881e-05 1.87924e-10 0.000378171
1.13763e+07 181.598 6083.83 1.38249e-05 1.8569e-10 0.000383339
1.18032e+07 187.487 6411.15 1.3758e-05 1.84714e-10 0.000387786
1.22462e+07 193.578 6754.7 1.37664e-05 1.88983e-10 0.000394445
1.27057e+07 199.888 7117.25 1.37182e-05 1.85717e-10 0.000398277
1.31826e+07 206.419 7497.07 1.36841e-05 1.84618e-10 0.000404639
1.36773e+07 213.173 7897.44 1.36495e-05 1.88605e-10 0.000417576
1.41906e+07 220.174 8326.11 1.36294e-05 1.88721e-10 0.000429853
1.47231e+07 227.424 8783.95 1.35752e-05 1.8687e-10 0.000433775
1.52757e+07 234.897 9263.3 1.34344e-05 1.83374e-10 0.000436959
1.58489e+07 242.598 9764.29 1.3456e-05 1.85768e-10 0.000444653
1.64437e+07 250.583 10293.2 1.33505e-05 1.82085e-10 0.00044916
1.70608e+07 258.852 10847.6 1.33951e-05 1.85768e-10 0.000454205
1.77011e+07 267.417 11429.2 1.33466e-05 1.84259e-10 0.000457857
1.83654e+07 276.264 12037.5 1.33286e-05 1.85264e-10 0.000465463
1.90546e+07 285.442 12679.1 1.32762e-05 1.83437e-10 0.000468748
1.97697e+07 294.91 13349.5 1.31843e-05 1.82927e-10 0.000471274
2.05116e+07 304.678 14048.8 1.31768e-05 1.82657e-10 0.000475703
2.12814e+07 314.79 14781.2 1.3096e-05 1.817e-10 0.000493208
2.208e+07 325.259 15569 1.31189e-05 1.82285e-10 0.000503775
2.29087e+07 336.137 16403.9 1.3103e-05 1.81742e-10 0.000512512
2.37684e+07 347.41 17285.1 1.30962e-05 1.86045e-10 0.000519533
2.46604e+07 359.069 18212 1.30631e-05 1.83519e-10 0.000527624
2.55859e+07 371.129 19188.6 1.29994e-05 1.819e-10 0.00053768
2.65461e+07 383.648 20221.1 1.30257e-05 1.84194e-10 0.000541005
2.75423e+07 396.575 21299.1 1.29109e-05 1.81313e-10 0.000548721
2.85759e+07 409.909 22433.4 1.28791e-05 1.83422e-10 0.000558069
2.96483e+07 423.689 23630.3 1.28288e-05 1.82092e-10 0.000561386
3.0761e+07 437.955 24879.6 1.2797e-05 1.81812e-10 0.000568546
3.19154e+07 452.699 26192.3 1.27142e-05 1.80672e-10 0.000577379
3.31131e+07 467.994 27575.4 1.28316e-05 1.86172e-10 0.000591188
3.43558e+07 483.879 29044.7 1.27556e-05 1.84688e-10 0.000597293
3.56451e+07 500.267 30584.9 1.27021e-05 1.80646e-10 0.000605495
3.69828e+07 517.301 32204.8 1.27203e-05 1.82636e-10 0.000616154
3.83707e+07 534.918 33915.2 1.26824e-05 1.8067e-10 0.000620391
3.98107e+07 553.216 35701.9 1.26978e-05 1.82227e-10 0.000633803
4.13048e+07 572.143 37595.7 1.26295e-05 1.80609e-10 0.000644246
4.28549e+07 591.737 39593 1.26378e-05 1.81297e-10 0.000646584
4.44631e+07 612.088 41672.8 1.26623e-05 1.83744e-10 0.000660652
4.61318e+07 633.192 43877.6 1.26268e-05 1.81013e-10 0.000670345
4.7863e+07 655.023 46198.6 1.2587e-05 1.82225e-10 0.000680713
4.96592e+07 677.663 48644 1.26227e-05 1.85245e-10 0.000692339
5.15229e+07 701.138 51224.6 1.25923e-05 1.83279e-10 0.000695666
5.34564e+07 725.402 53914.8 1.25185e-05 1.80605e-10 0.000702998
5.54626e+07 750.544 56735.4 1.25047e-05 1.81737e-10 0.000714174
5.7544e+07 776.684 59708.4 1.25471e-05 1.81736e-10 0.000737052
5.97035e+07 803.68 62891.8 1.24873e-05 1.81205e-10 0.000732687
6.19441e+07 831.69 66175.1 1.25181e-05 1.82216e-10 0.000753213
6.42688e+07 860.787 69677 1.25318e-05 1.84101e-10 0.000759133
6.66807e+07 890.934 73338.9 1.24967e-05 1.84013e-10 0.000782618
6.91831e+07 922.138 77255.8 1.24413e-05 1.82395e-10 0.000795375
7.17794e+07 954.419 81385.9 1.24167e-05 1.8415e-10 0.000818945
7.44732e+07 987.878 85798 1.24004e-05 1.79939e-10 0.000810257
7.72681e+07 1022.54 90327.1 1.23988e-05 1.81292e-10 0.000841763
8.01678e+07 1058.48 95209 1.24082e-05 1.82285e-10 0.000828811
8.31764e+07 1095.74 100196 1.2341e-05 1.7914e-10 0.00083323
8.62979e+07 1134.38 105398 1.23777e-05 1.82794e-10 0.000851684
8.95365e+07 1174.45 110914 1.23696e-05 1.83164e-10 0.000874181
9.28966e+07 1215.9 116789 1.23615e-05 1.81538e-10 0.000866668
9.63829e+07 1258.84 122832 1.23385e-05 1.81207e-10 25272.2
