1	1.0715	0	0
1.0715	1.1482	0	0
1.1482	1.2303	0	0
1.2303	1.3183	0	0
1.3183	1.4125	0	0
1.4125	1.5136	0	0
1.5136	1.6218	0	0
1.6218	1.7378	0	0
1.7378	1.8621	0	0
1.8621	1.9953	0	0
1.9953	2.138	0	0
2.138	2.2909	0	0
2.2909	2.4547	0	0
2.4547	2.6303	0	0
2.6303	2.8184	0	0
2.8184	3.02	0	0
3.02	3.2359	0	0
3.2359	3.4674	0	0
3.4674	3.7154	0	0
3.7154	3.9811	0	0
3.9811	4.2658	0	0
4.2658	4.5709	0	0
4.5709	4.8978	0	0
4.8978	5.2481	0	0
5.2481	5.6234	0	0
5.6234	6.0256	0	0
6.0256	6.4565	0	0
6.4565	6.9183	0	0
6.9183	7.4131	0	0
7.4131	7.9433	0	0
7.9433	8.5114	0	0
8.5114	9.1201	0	0
9.1201	9.7724	0	0
9.7724	10.471	0	0
10.471	11.22	0	0
11.22	12.023	0	0
12.023	12.882	0	0
12.882	13.804	0	0
13.804	14.791	0	0
14.791	15.849	0	0
15.849	16.982	0	0
16.982	18.197	0	0
18.197	19.498	0	0
19.498	20.893	1.2255e-06	8.7561e-06
20.893	22.387	1.28492e-05	0.000130833
22.387	23.988	2.105274e-05	0.00019382
23.988	25.704	2.943351e-05	0.000163373
25.704	27.542	8.071284e-05	0.0004368297
27.542	29.512	0.00011773598	0.0006033968
29.512	31.623	0.00025334412	0.0009639986
31.623	33.884	0.00041689998	0.001472251
33.884	36.308	0.0004828544	0.0017880852
36.308	38.905	0.0005939063853	0.0021379925964
38.905	41.687	0.0006442400996	0.002289994709
41.687	44.668	0.000720951134	0.00255840363
44.668	47.863	0.0008943367932	0.0029308953742
47.863	51.286	0.00118302698	0.0035805945
51.286	54.954	0.00135450103	0.0037476475
54.954	58.884	0.00147749348	0.0040237466
58.884	63.096	0.0015792733	0.0041356495
63.096	67.608	0.0018698324	0.0045792164
67.608	72.444	0.0022159626	0.004864209
72.444	77.625	0.0023112853	0.004819176
77.625	83.176	0.0024400464	0.00486967
83.176	89.125	0.0025176959	0.004922744
89.125	95.499	0.0027587266	0.005036935
95.499	102.33	0.0029707021	0.004991859
102.33	109.65	0.0029760327	0.004751252
109.65	117.49	0.003019417	0.004597409
117.49	125.89	0.003040091	0.004364744
125.89	134.9	0.003095479	0.004254899
134.9	144.54	0.003026868	0.003978201
144.54	154.88	0.0030311	0.003726607
154.88	165.96	0.002970785	0.003442304
165.96	177.83	0.002820236	0.00313094
177.83	190.55	0.002680238	0.002880005
190.55	204.17	0.002483558	0.002550508
204.17	218.78	0.002294073	0.002244645
218.78	234.42	0.002196724	0.001960477
234.42	251.19	0.002054391	0.001737735
251.19	269.15	0.00188918	0.001531986
269.15	288.4	0.001711045	0.0013313975
288.4	309.03	0.0015410835	0.0011347972
309.03	331.13	0.0014161534	0.0009761007
331.13	354.81	0.0012545988	0.0008162558
354.81	380.19	0.0011236471	0.0006935054
380.19	407.38	0.0010014951	0.0005834452
407.38	436.52	0.0008799209	0.000482061
436.52	467.74	0.0007592501	0.0004010198
467.74	501.19	0.000661242	0.0003297587
501.19	537.03	0.0005855148	0.0002763028
537.03	575.44	0.0004916619	0.0002226306
575.44	616.6	0.0004181239	0.0001780536
616.6	660.69	0.0003644542	0.00014277823
660.69	707.95	0.00030044406	0.00011501623
707.95	758.58	0.00025574584	9.18053e-05
758.58	812.83	0.00021161801	7.418181e-05
812.83	870.96	0.00017353933	5.921671e-05
870.96	933.25	0.00014138909	4.501702e-05
933.25	1000	0.00011859113	3.569067e-05
1000	1071.5	9.788373e-05	2.782143e-05
1071.5	1148.2	8.130234e-05	2.205339e-05
1148.2	1230.3	7.021945e-05	1.7713267e-05
1230.3	1318.3	5.861262e-05	1.3887333e-05
1318.3	1412.5	4.7120781e-05	1.0947346e-05
1412.5	1513.6	3.7455391e-05	8.38418499999999e-06
1513.6	1621.8	2.9767111e-05	6.544279e-06
1621.8	1737.8	2.5197278e-05	5.152039e-06
1737.8	1862.1	2.1717766e-05	4.020758e-06
1862.1	1995.3	1.6151103e-05	3.002735e-06
1995.3	2138	1.3961547e-05	2.3975079e-06
2138	2290.9	1.13735682e-05	1.845263e-06
2290.9	2454.7	1.00132284e-05	1.4132073e-06
2454.7	2630.3	7.557307e-06	1.0760963e-06
2630.3	2818.4	5.919869e-06	8.343704e-07
2818.4	3020	5.0270267e-06	6.559179e-07
3020	3235.9	3.886247e-06	4.807852e-07
3235.9	3467.4	3.3081476e-06	3.812325e-07
3467.4	3715.4	2.43683188e-06	2.8612213e-07
3715.4	3981.1	1.88308929e-06	2.2160138e-07
3981.1	4265.8	1.649160735e-06	1.7176977e-07
4265.8	4570.9	1.218774487e-06	1.2534622e-07
4570.9	4897.8	1.156672704e-06	9.961576e-08
4897.8	5248.1	8.99519591e-07	7.9038355e-08
5248.1	5623.4	7.27183965e-07	5.9754828e-08
5623.4	6025.6	4.58221458e-07	4.9217248e-08
6025.6	6456.5	4.36979624e-07	3.6115699e-08
6456.5	6918.3	2.992196074e-07	2.77352406e-08
6918.3	7413.1	2.854711572e-07	2.11703858e-08
7413.1	7943.3	1.671153498e-07	1.7167382e-08
7943.3	8511.4	8.34310097e-08	1.22156622e-08
8511.4	9120.1	6.33944688e-08	9.13999710000000e-09
9120.1	9772.4	7.33802149e-08	7.3119576e-09
9772.4	10471	4.281657e-08	6.1456851e-09
10471	11220	4.47406745e-08	4.899529e-09
11220	12023	2.68163145e-08	2.92350043e-09
12023	12882	3.77041196e-08	2.73213053e-09
12882	13804	3.28874495e-08	2.2743157e-09
13804	14791	2.89225433e-08	1.82121608e-09
14791	15849	3.278072062e-08	1.23276901e-09
15849	16982	3.494049524e-08	1.07632393e-09
16982	18197	1.830532006e-08	5.8046235e-10
18197	19498	1.751017312e-08	5.7093305e-10
19498	20893	1.1226787e-08	4.7066801e-10
20893	22387	5.45419174e-09	3.2935879e-10
22387	23988	2.33962108e-09	2.65804081e-10
23988	25704	1.9904728e-09	1.8615982e-10
25704	27542	1.91205643e-09	1.3139112e-10
27542	29512	1.76261438e-09	1.0903488e-10
29512	31623	1.54262356e-09	9.6755724e-11
31623	33884	1.43613234e-09	4.4256752e-11
33884	36308	1.34026844e-09	5.5966361e-11
36308	38905	1.22889401e-09	3.0914621e-11
38905	41687	4.3063114e-09	4.6082174e-11
41687	44668	1.63748827e-09	2.2295519e-11
44668	47863	3.4526171e-10	2.7405629e-11
47863	51286	9.3306683e-10	1.4961196e-11
51286	54954	2.3688631e-09	7.07287e-12
54954	58884	1.97566336e-09	6.891064e-12
58884	63096	9.0707012e-10	5.134476e-12
63096	67608	2.10280483e-09	2.662976e-12
67608	72444	8.5206884e-10	8.66117e-13
72444	77625	7.6373729e-10	1.728063e-12
77625	83176	1.21366156e-09	9.88714e-13
83176	89125	2.0340773e-10	4.57232e-13
89125	95499	2.3830654e-10	2.691555e-12
95499	102330	2.1903054e-10	1.033452e-12
102330	109650	1.8145312e-10	1.15635e-13
109650	117490	1.2994504e-10	5.70084e-14
117490	125890	7.2952e-11	1.1644e-14
125890	134900	6.252906e-11	4.00433e-14
134900	144540	5.027095e-11	3.149902e-13
144540	154880	5.301e-11	8.5181e-15
154880	165960	3.5027277e-11	1.270411e-13
165960	177830	3.4627e-11	5.4888e-15
177830	190550	3.2788e-11	5.2148e-15
190550	204170	1.417e-10	2.277e-14
204170	218780	0	0
218780	234420	0	0
234420	251190	0	0
251190	269150	0	0
269150	288400	0	0
288400	309030	0	0
309030	331130	0	0
331130	354810	0	0
354810	380190	0	0
380190	407380	0	0
407380	436520	0	0
436520	467740	0	0
467740	501190	0	0
501190	537030	0	0
537030	575440	0	0
575440	616600	0	0
616600	660690	0	0
660690	707950	0	0
707950	758580	0	0
758580	812830	0	0
812830	870960	0	0
870960	933250	0	0
933250	1e+06	0	0
