1	0.00097476885	0.015576658
1.06412	0.00115933387	0.0184215547
1.13235	0.0017244348	0.022957984
1.20495	0.00192470197	0.0243625535
1.28221	0.00222837402	0.0281036365
1.36442	0.00276165898	0.02846735947
1.4519	0.00435049182	0.0395124214
1.545	0.00442148196	0.0429325756
1.64406	0.00448329726	0.0433199904
1.74947	0.005731359045	0.0514397843
1.86165	0.00704815506	0.0599110657
1.98101	0.0077634698	0.0637224419
2.10803	0.00784539421	0.0590952298
2.24319	0.00823203623	0.0586186276
2.38702	0.0098307501	0.0644638867
2.54007	0.01154278857	0.0699884387
2.70293	0.011898607	0.068413948
2.87624	0.0125660111	0.068573052
3.06066	0.0135475237	0.070877948
3.2569	0.0149527073	0.0751402559
3.46572	0.0159755528	0.0717489397
3.68794	0.0166500048	0.071715791
3.9244	0.0163923258	0.068853929
4.17603	0.0184401942	0.072787709
4.44378	0.018790181	0.070149965
4.72871	0.0197503797	0.068677423
5.0319	0.0193922233	0.064910387
5.35454	0.020142087	0.06309961
5.69786	0.0209337192	0.062640254
6.06319	0.0206027733	0.059128895
6.45195	0.0212147058	0.058011498
6.86563	0.0207701176	0.052070526
7.30584	0.0211186433	0.049649877
7.77428	0.0203328361	0.046514057
8.27275	0.0207942497	0.04472815
8.80318	0.021333173	0.043272209
9.36762	0.0205442292	0.039792936
9.96825	0.0192792843	0.035138584
10.6074	0.019377984	0.033591774
11.2875	0.0187630708	0.030285059
12.0112	0.0180807396	0.028085111
12.7814	0.0174709763	0.025791056
13.6009	0.0171702861	0.024250561
14.473	0.016914593	0.022655259
15.4009	0.016409866	0.020547114
16.3884	0.0152585593	0.0178381544
17.4392	0.0150154518	0.0167879943
18.5573	0.0145175582	0.0152313782
19.7472	0.0139222382	0.0142816196
21.0134	0.0132569677	0.0125141243
22.3607	0.0126239611	0.0111752198
23.7944	0.0119987386	0.0100958936
25.32	0.0112761287	0.0089783324
26.9435	0.0105640459	0.0078789207
28.6711	0.00975915640000001	0.0068872705
30.5094	0.009154512	0.0062246765
32.4656	0.0086272664	0.0055586462
34.5472	0.0079200854	0.0048471318
36.7623	0.0074555923	0.0043828768
39.1194	0.0069873023	0.0037967774
41.6277	0.0064352677	0.0033171954
44.2967	0.0060336422	0.0029763389
47.1369	0.0054791421	0.002555941
50.1593	0.0052142346	0.0023008993
53.3754	0.0048519569	0.00207705
56.7977	0.0044798636	0.00183380727
60.4394	0.0041066608	0.0015968271
64.3146	0.0038942327	0.00139356157
68.4384	0.0034918176	0.00119531364
72.8265	0.0032279452	0.0010505745
77.4959	0.0029160564	0.00090957031
82.4648	0.0026607291	0.00078624749
87.7523	0.0024502342	0.00068462602
93.3788	0.0023090274	0.00061610429
99.366	0.0021117142	0.00052863341
105.737	0.00190750825	0.00043977228
112.517	0.00169952101	0.00037143385
119.731	0.00154251206	0.00032071936
127.408	0.00142544168	0.000284568
135.577	0.00129098423	0.00023634233
144.27	0.00114320961	0.00020005943
153.52	0.00100232851	0.000163436004
163.364	0.00092770881	0.000141324598
173.838	0.00084166542	0.000124032829
184.984	0.00075828914	0.00010587185
196.845	0.00069282264	9.3431294e-05
209.466	0.00061210613	7.2705577e-05
222.897	0.00054766234	6.0609539e-05
237.188	0.00048298926	5.1781152e-05
252.396	0.00042750151	4.662247e-05
268.58	0.00038132535	3.9706053e-05
285.8	0.000343773028	3.3355636e-05
304.125	0.000296166621	2.693245e-05
323.625	0.000257931062	2.23717232e-05
344.375	0.000221298631	1.78683979e-05
366.456	0.000206002426	1.51383332e-05
389.952	0.000184166941	1.28013646e-05
414.955	0.000169161155	1.08029967e-05
441.561	0.000143681572	8.4687658e-06
469.873	0.000123117984	6.9104024e-06
