0.001 0.00112333 1.98499e-06 1.12333 1.98499 0.00202223
0.00103753 0.00116549 2.13677e-06 1.12333 1.98499 0.00209812
0.00107647 0.00120923 2.30016e-06 1.12333 1.98499 0.00217686
0.00111686 0.00125461 2.47604e-06 1.12333 1.98499 0.00225856
0.00115878 0.00130169 2.66537e-06 1.12333 1.98499 0.00234332
0.00120226 0.00135054 2.86918e-06 1.12333 1.98499 0.00243126
0.00124738 0.00140122 3.08857e-06 1.12333 1.98499 0.0025225
0.0012942 0.00145381 3.32474e-06 1.12333 1.98499 0.00261716
0.00134276 0.00150837 3.57896e-06 1.12333 1.98499 0.00271538
0.00139316 0.00156498 3.85263e-06 1.12333 1.98499 0.00281729
0.00144544 0.00162371 4.14722e-06 1.12333 1.98499 0.00292301
0.00149968 0.00168464 4.46434e-06 1.12333 1.98499 0.00303271
0.00155597 0.00174786 4.80571e-06 1.12333 1.98499 0.00314652
0.00161436 0.00181346 5.17318e-06 1.12333 1.98499 0.00326461
0.00167494 0.00188152 5.56875e-06 1.12333 1.98499 0.00338712
0.0017378 0.00195213 5.99456e-06 1.12333 1.98499 0.00351424
0.00180302 0.00202539 6.45294e-06 1.12333 1.98499 0.00364612
0.00187068 0.0021014 6.94636e-06 1.12333 1.98499 0.00378295
0.00194089 0.00218026 7.47752e-06 1.12333 1.98499 0.00392492
0.00201372 0.00226208 8.04929e-06 1.12333 1.98499 0.00407222
0.0020893 0.00234697 8.66478e-06 1.12333 1.98499 0.00422504
0.0021677 0.00243505 9.32733e-06 1.12333 1.98499 0.0043836
0.00224905 0.00252643 1.00405e-05 1.12333 1.98499 0.00454811
0.00233346 0.00262125 1.08083e-05 1.12333 1.98499 0.00471879
0.00242103 0.00271962 1.16348e-05 1.12333 1.98499 0.00489588
0.00251189 0.00282168 1.25244e-05 1.12333 1.98499 0.00507962
0.00260615 0.00292757 1.34821e-05 1.12333 1.98499 0.00527025
0.00270396 0.00303744 1.4513e-05 1.12333 1.98499 0.00546803
0.00280543 0.00315143 1.56227e-05 1.12333 1.98499 0.00567324
0.00291072 0.0032697 1.68173e-05 1.12333 1.98499 0.00588615
0.00301995 0.00339241 1.81033e-05 1.12333 1.98499 0.00610704
0.00313329 0.00351972 1.94876e-05 1.12333 1.98499 0.00633623
0.00325087 0.00365181 2.09777e-05 1.12333 1.98499 0.00657402
0.00337287 0.00378885 2.25817e-05 1.12333 1.98499 0.00682073
0.00349945 0.00393104 2.43085e-05 1.12333 1.98499 0.0070767
0.00363078 0.00407857 2.61672e-05 1.12333 1.98499 0.00734228
0.00376704 0.00423163 2.81681e-05 1.12333 1.98499 0.00761783
0.00390841 0.00439044 3.0322e-05 1.12333 1.98499 0.00790371
0.00405509 0.0045552 3.26405e-05 1.12333 1.98499 0.00820032
0.00420727 0.00472615 3.51364e-05 1.12333 1.98499 0.00850807
0.00436516 0.00490352 3.78231e-05 1.12333 1.98499 0.00882736
0.00452898 0.00508754 4.07153e-05 1.12333 1.98499 0.00915864
0.00469894 0.00527847 4.38286e-05 1.12333 1.98499 0.00950235
0.00487528 0.00547656 4.71799e-05 1.12333 1.98499 0.00985896
0.00505825 0.00568208 5.07876e-05 1.12333 1.98499 0.0102289
0.00524807 0.00589532 5.4671e-05 1.12333 1.98499 0.0106128
0.00544503 0.00611657 5.88515e-05 1.12333 1.98499 0.0110111
0.00564937 0.00634611 6.33516e-05 1.12333 1.98499 0.0114243
0.00586138 0.00658427 6.81958e-05 1.12333 1.98499 0.0118531
0.00608135 0.00683137 7.34104e-05 1.12333 1.98499 0.0122979
0.00630957 0.00708774 7.90237e-05 1.12333 1.98499 0.0127594
0.00654636 0.00735373 8.50663e-05 1.12333 1.98499 0.0132383
0.00679204 0.0076297 9.15709e-05 1.12333 1.98499 0.0137351
0.00704693 0.00791604 9.85729e-05 1.12333 1.98499 0.0142505
0.00731139 0.00821311 0.00010611 1.12333 1.98499 0.0147853
0.00758578 0.00852134 0.000114224 1.12333 1.98499 0.0153402
0.00787046 0.00884113 0.000122958 1.12333 1.98499 0.0159159
0.00816582 0.00917292 0.00013236 1.12333 1.98499 0.0165132
0.00847227 0.00951717 0.000142481 1.12333 1.98499 0.0171329
0.00879023 0.00987433 0.000153376 1.12333 1.98499 0.0177759
0.00912011 0.0102449 0.000165104 1.12333 1.98499 0.018443
0.00946237 0.0106294 0.000177729 1.12333 1.98499 0.0191351
0.00981748 0.0110283 0.000191319 1.12333 1.98499 0.0198532
0.0101859 0.0114422 0.000205948 1.12333 1.98499 0.0205983
0.0105682 0.0118716 0.000221696 1.12333 1.98499 0.0213713
0.0109648 0.0123171 0.000238648 1.12333 1.98499 0.0221733
0.0113763 0.0127793 0.000256896 1.12333 1.98499 0.0230055
0.0118032 0.0132589 0.00027654 1.12333 1.98499 0.0238688
0.0122462 0.0137565 0.000297685 1.12333 1.98499 0.0247646
0.0127057 0.0142728 0.000320448 1.12333 1.98499 0.025694
0.0131826 0.0148084 0.000344951 1.12333 1.98499 0.0266582
0.0136773 0.0153641 0.000371328 1.12333 1.98499 0.0276587
0.0141906 0.0159407 0.000399721 1.12333 1.98499 0.0286966
0.0147231 0.0165389 0.000430286 1.12333 1.98499 0.0297736
0.0152757 0.0171596 0.000463188 1.12333 1.98499 0.0308909
0.0158489 0.0178036 0.000498606 1.12333 1.98499 0.0320502
0.0164437 0.0184717 0.000536732 1.12333 1.98499 0.033253
0.0170608 0.019165 0.000577773 1.12333 1.98499 0.0345009
0.0177011 0.0198842 0.000621953 1.12333 1.98499 0.0357957
0.0183654 0.0206304 0.00066951 1.12333 1.98499 0.0371391
0.0190546 0.0214046 0.000720705 1.12333 1.98499 0.0385328
0.0197697 0.0222079 0.000775813 1.12333 1.98499 0.0399789
0.0205116 0.0230413 0.000835136 1.12333 1.98499 0.0414793
0.0212814 0.023906 0.000898995 1.12333 1.98499 0.0430359
0.02208 0.0248032 0.000967737 1.12333 1.98499 0.044651
0.0229087 0.025734 0.00104174 1.12333 1.98499 0.0463267
0.0237684 0.0266998 0.00112139 1.12333 1.98499 0.0480652
0.0246604 0.0277018 0.00120714 1.12333 1.98499 0.049869
0.0255859 0.0287414 0.00129944 1.12333 1.98499 0.0517405
0.0265461 0.02982 0.00139881 1.12333 1.98499 0.0536823
0.0275423 0.0309391 0.00150577 1.12333 1.98499 0.0556969
0.0285759 0.0321002 0.0016209 1.12333 1.98499 0.0577871
0.0296483 0.0333049 0.00174485 1.12333 1.98499 0.0599558
0.030761 0.0345547 0.00187827 1.12333 1.98499 0.0622058
0.0319154 0.0358515 0.00202189 1.12333 1.98499 0.0645403
0.0331131 0.037197 0.00217649 1.12333 1.98499 0.0669624
0.0343558 0.0385929 0.00234292 1.12333 1.98499 0.0694754
0.0356451 0.0400413 0.00252207 1.12333 1.98499 0.0720827
0.0369828 0.0415439 0.00271492 1.12333 1.98499 0.0747878
0.0383707 0.043103 0.00292252 1.12333 1.98499 0.0775945
0.0398107 0.0447206 0.00314599 1.12333 1.98499 0.0805065
0.0413048 0.0463989 0.00338655 1.12333 1.98499 0.0835278
0.0428549 0.0481402 0.0036455 1.12333 1.98499 0.0866625
0.0444631 0.0499468 0.00392426 1.12333 1.98499 0.0899148
0.0461318 0.0518212 0.00422433 1.12333 1.98499 0.0932891
0.047863 0.053766 0.00454734 1.12333 1.98499 0.0967901
0.0496592 0.0557838 0.00489505 1.12333 1.98499 0.100422
0.0515229 0.0578772 0.00526935 1.12333 1.98499 0.104191
0.0534564 0.0600493 0.00567228 1.12333 1.98499 0.108101
0.0554626 0.0623028 0.00610601 1.12333 1.98499 0.112158
0.057544 0.0646409 0.0065729 1.12333 1.98499 0.116367
0.0597035 0.0670668 0.0070755 1.12333 1.98499 0.120734
0.0619441 0.0695837 0.00761653 1.12333 1.98499 0.125265
0.0642688 0.0721951 0.00819893 1.12333 1.98499 0.129966
0.0666807 0.0749045 0.00882587 1.12333 1.98499 0.134844
0.0691831 0.0777155 0.00950074 1.12333 1.98499 0.139904
0.0717794 0.0806321 0.0102272 1.12333 1.98499 0.145155
0.0744732 0.083658 0.0110092 1.12333 1.98499 0.150602
0.0772681 0.0867976 0.0118511 1.12333 1.98499 0.156254
0.0801678 0.090055 0.0127573 1.12333 1.98499 0.162118
0.0831764 0.0934346 0.0137327 1.12333 1.98499 0.168202
0.0862979 0.096941 0.0147828 1.12333 1.98499 0.174514
0.0895365 0.100579 0.0159132 1.12333 1.98499 0.181064
0.0928966 0.104354 0.01713 1.12333 1.98499 0.187859
0.0963829 0.10827 0.0184398 1.12333 1.98499 0.194909
0.1 0.112333 0.0198499 1.12333 1.98499 0.202223
0.103753 0.116549 0.0213677 1.12333 1.98499 0.209812
0.107647 0.120923 0.0230016 1.12333 1.98499 0.217686
0.111686 0.125461 0.0247604 1.12333 1.98499 0.225856
0.115878 0.130169 0.0266537 1.12333 1.98499 0.234332
0.120226 0.135054 0.0286918 1.12333 1.98499 0.243126
0.124738 0.140122 0.0308857 1.12333 1.98499 0.252024
0.12942 0.145381 0.0332453 1.12323 1.98074 0.261363
0.134276 0.150836 0.0357841 1.12323 1.98074 0.271164
0.139316 0.156496 0.038517 1.12323 1.98074 0.281332
0.144544 0.162369 0.0414587 1.12323 1.98074 0.291882
0.149968 0.168462 0.0446254 1.12323 1.98074 0.302829
0.155597 0.174784 0.0480341 1.12323 1.98074 0.314186
0.161436 0.181342 0.0517033 1.12323 1.98074 0.325969
0.167494 0.188147 0.055653 1.12323 1.98074 0.338582
0.17378 0.195209 0.0599095 1.12331 1.98572 0.351183
0.180302 0.202534 0.0644902 1.12331 1.98572 0.36415
0.187068 0.210135 0.0694182 1.12318 1.98199 0.377368
0.194089 0.218019 0.0747167 1.12302 1.97725 0.390936
0.201372 0.226199 0.0804117 1.12288 1.97366 0.405299
0.20893 0.234684 0.0865375 1.12276 1.97081 0.419983
0.21677 0.243487 0.0931236 1.12263 1.96819 0.435572
0.224905 0.25262 0.10021 1.12266 1.96961 0.452336
0.233346 0.262096 0.107846 1.12273 1.97545 0.46919
0.242103 0.271928 0.116064 1.12263 1.9745 0.486376
0.251189 0.282128 0.124902 1.12255 1.97274 0.504353
0.260615 0.292709 0.134411 1.12248 1.97124 0.522873
0.270396 0.303687 0.144638 1.12226 1.96902 0.54136
0.280543 0.315073 0.155625 1.12196 1.96115 0.560441
0.291072 0.326883 0.167426 1.1215 1.95439 0.58049
0.301995 0.339133 0.180108 1.12129 1.95272 0.601785
0.313329 0.351841 0.193749 1.12112 1.95255 0.623164
0.325087 0.365022 0.208404 1.12061 1.94473 0.644282
0.337287 0.378689 0.224125 1.11996 1.93261 0.666618
0.349945 0.392864 0.241 1.11975 1.93337 0.690427
0.363078 0.407566 0.259135 1.11915 1.92794 0.714405
0.376704 0.422812 0.278604 1.11862 1.92363 0.739824
0.390841 0.438624 0.299522 1.11821 1.92013 0.764712
0.405509 0.455019 0.321955 1.1174 1.91271 0.79145
0.420727 0.472022 0.346043 1.11712 1.91208 0.819612
0.436516 0.489658 0.371925 1.11669 1.90955 0.848053
0.452898 0.507943 0.399711 1.11576 1.90212 0.87791
0.469894 0.526904 0.429553 1.11518 1.90196 0.909617
0.487528 0.54657 0.461635 1.11495 1.906 0.941489
0.505825 0.566963 0.496086 1.11418 1.89866 0.972388
0.524807 0.588106 0.533003 1.11341 1.89099 1.00766
0.544503 0.610032 0.572695 1.11294 1.89828 1.0437
0.564937 0.63277 0.61535 1.11231 1.89654 1.07976
0.586138 0.656344 0.661134 1.11167 1.89609 1.11701
0.608135 0.680787 0.710275 1.11075 1.89163 1.15436
0.630957 0.706124 0.762966 1.10999 1.88837 1.19566
0.654636 0.732402 0.819589 1.10964 1.89205 1.23943
0.679204 0.759657 0.880488 1.10906 1.89974 1.28462
0.704693 0.787922 0.945977 1.1086 1.90175 1.33161
0.731139 0.817233 1.01641 1.10804 1.90923 1.377
0.758578 0.847615 1.09197 1.10624 1.89636 1.42119
0.787046 0.879097 1.17289 1.10535 1.89336 1.46899
0.816582 0.911728 1.25967 1.10408 1.89026 1.52029
0.847227 0.945556 1.35285 1.10361 1.89863 1.57464
0.879023 0.980628 1.45298 1.10257 1.90274 1.6308
0.912011 1.017 1.56057 1.10256 1.90765 1.68705
0.946237 1.05471 1.67606 1.10184 1.91138 1.74856
0.981748 1.09383 1.80024 1.10141 1.92056 1.80985
1.01859 1.13439 1.9336 1.10073 1.9194 1.87282
1.05682 1.17645 2.07679 1.09989 1.92861 1.93924
1.09648 1.22005 2.23061 1.09881 1.92694 2.00845
1.13763 1.26527 2.3959 1.0986 1.93294 2.08322
1.18032 1.31216 2.57378 1.09788 1.94477 2.1597
1.22462 1.36079 2.76511 1.09766 1.95709 2.23419
1.27057 1.4112 2.97047 1.09605 1.94038 2.30422
1.31826 1.46346 3.19021 1.09605 1.93402 2.3896
1.36773 1.51769 3.42665 1.09594 1.9505 2.4773
1.41906 1.57395 3.68096 1.0961 1.95364 2.56293
1.47231 1.6323 3.95394 1.09433 1.94783 2.64117
1.52757 1.69274 4.24581 1.09338 1.93311 2.72581
1.58489 1.75539 4.55833 1.09276 1.93991 2.82396
1.64437 1.82036 4.89426 1.09173 1.93841 2.91799
1.70608 1.88772 5.2544 1.09091 1.92565 3.00467
1.77011 1.95755 5.63916 1.09018 1.9023 3.09989
1.83654 2.02999 6.05101 1.09008 1.90911 3.20709
1.90546 2.10514 6.49309 1.09015 1.91694 3.31442
1.97697 2.18308 6.96711 1.08999 1.91858 3.41924
2.05116 2.26393 7.47448 1.08963 1.91385 3.53071
2.12814 2.3478 8.01804 1.08947 1.92385 3.6524
2.208 2.43482 8.60144 1.08965 1.93327 3.77532
2.29087 2.52509 9.22711 1.089 1.92627 3.89784
2.37684 2.61868 9.89733 1.08816 1.92422 4.01765
2.46604 2.71573 10.6141 1.08716 1.91361 4.14009
2.55859 2.81631 11.3804 1.08698 1.92187 4.27459
2.65461 2.92065 12.2013 1.08711 1.92907 4.42232
2.75423 3.0289 13.0824 1.08589 1.92685 4.57738
2.85759 3.14118 14.0286 1.08609 1.94379 4.73415
2.96483 3.25765 15.044 1.08652 1.96011 4.89149
3.0761 3.37849 16.1325 1.08619 1.95743 5.05232
3.19154 3.50383 17.299 1.08587 1.97373 5.24661
3.31131 3.63395 18.5558 1.08681 2.00113 5.44763
3.43558 3.76902 19.9098 1.08711 2.01046 5.63938
3.56451 3.90931 21.364 1.08831 2.02986 5.79668
3.69828 4.0548 22.9148 1.08784 1.99901 5.97846
3.83707 4.20575 24.5743 1.08895 2.02985 6.17775
3.98107 4.36239 26.3535 1.08685 1.99077 6.34417
4.13048 4.52483 28.2492 1.08679 1.99025 6.53136
4.28549 4.69336 30.274 1.08748 1.98766 6.72438
4.44631 4.86822 32.437 1.08743 1.99608 6.9599
4.61318 5.04973 34.7597 1.08705 1.99463 7.14936
4.7863 5.23789 37.2351 1.08733 1.98019 7.38069
4.96592 5.43334 39.8866 1.08872 2.01397 7.63135
5.15229 5.63615 42.731 1.08718 2.00791 7.85548
5.34564 5.84649 45.7688 1.08781 2.01408 8.10185
5.54626 6.06479 49.0195 1.08783 2.0198 8.34241
5.7544 6.29121 52.4923 1.08752 2.01066 8.57991
5.97035 6.52603 56.1981 1.08665 1.99726 8.80716
6.19441 6.76951 60.1447 1.08729 1.99993 9.10032
6.42688 7.02229 64.3757 1.08688 2.00865 9.39035
6.66807 7.28444 68.9055 1.0861 2.01896 9.66349
6.91831 7.5564 73.7419 1.08787 2.03644 9.92576
7.17794 7.83867 78.896 1.08743 2.01108 10.1716
7.44732 8.13148 84.376 1.08765 1.98808 10.4659
7.72681 8.43568 90.2261 1.08867 2.01056 10.7916
8.01678 8.75149 96.4847 1.08938 2.01345 11.133
8.31764 9.07954 103.184 1.09078 2.04503 11.4667
8.62979 9.41991 110.342 1.09027 2.02881 11.8165
8.95365 9.77313 117.996 1.09094 2.04231 12.1186
9.28966 10.1393 126.14 1.09011 2.03526 12.467
9.63829 10.5194 134.833 1.09092 2.05683 12.8486
10 10.9142 144.128 1.09191 2.05894 13.2372
10.3753 11.3245 154.063 1.09253 2.05703 13.5942
10.7647 11.7497 164.649 1.0918 2.04242 13.9779
11.1686 12.1913 175.943 1.09444 2.08728 14.3553
11.5878 12.6495 187.977 1.09268 2.04754 14.7387
12.0226 13.1249 200.796 1.09478 2.07184 15.2311
12.4738 13.6197 214.54 1.09734 2.08998 15.6719
12.942 14.1336 229.213 1.09791 2.11245 16.1748
13.4276 14.6676 244.925 1.09918 2.14383 16.5701
13.9316 15.2218 261.624 1.10146 2.15298 17.0159
14.4544 15.7976 279.417 1.09928 2.10373 17.3387
14.9968 16.3941 298.228 1.09859 2.10207 17.744
15.5597 17.0121 318.201 1.09667 2.08848 18.152
16.1436 17.6529 339.4 1.09976 2.09853 18.6468
16.7494 18.3188 361.994 1.09957 2.10331 19.049
17.378 19.0087 385.942 1.09645 2.11074 19.4795
18.0302 19.723 411.35 1.0953 2.06332 19.9792
18.7068 20.4646 438.387 1.09713 2.07407 20.4859
19.4089 21.2357 467.151 1.09895 2.08825 21.0174
20.1372 22.0369 497.768 1.10079 2.12774 21.6156
20.893 22.8693 530.439 1.10153 2.10468 22.116
21.677 23.7331 565.12 1.1013 2.10031 22.5525
22.4905 24.6283 601.814 1.09998 2.08797 23.0112
23.3346 25.5563 640.658 1.10117 2.09933 23.5526
24.2103 26.5194 681.908 1.09834 2.08358 24.0012
25.1189 27.5161 725.522 1.09725 2.06873 24.4574
26.0615 28.5496 771.633 1.09719 2.07719 24.9822
27.0396 29.624 820.5 1.10076 2.12156 25.5664
28.0543 30.7401 872.387 1.09858 2.08735 26.1071
29.1072 31.8983 927.36 1.09887 2.08883 26.5434
30.1995 33.096 985.349 1.09658 2.08996 27.2302
31.3329 34.3394 1047.07 1.09838 2.08807 27.7199
32.5087 35.6283 1112.26 1.0958 2.07332 28.0689
33.7287 36.9611 1180.75 1.09108 2.04625 28.5859
34.9945 38.3431 1253.12 1.09292 2.04935 29.2434
36.3078 39.7792 1329.93 1.09278 2.03793 29.9462
37.6704 41.2703 1411.54 1.09499 2.06612 30.7442
39.0841 42.8198 1498.46 1.09809 2.08914 31.5594
40.5509 44.4318 1591.04 1.09542 2.06227 31.9725
42.0727 46.0986 1688.35 1.09551 2.06912 32.6496
43.6516 47.8278 1791.46 1.0955 2.09465 33.0968
45.2898 49.6171 1899.89 1.08996 2.05946 33.6072
46.9894 51.4694 2014.13 1.08748 2.01128 33.8767
48.7528 53.3875 2133.61 1.09066 2.05397 34.7379
50.5825 55.3847 2260.73 1.09531 2.09089 35.2859
52.4807 57.4638 2394.69 1.09455 2.0799 35.8685
54.4503 59.6201 2535.98 1.09587 2.10817 36.6254
56.4937 61.8596 2685.66 1.09573 2.08098 37.4249
58.6138 64.1782 2844.35 1.0938 2.05917 38.1112
60.8135 66.58 3012.02 1.08959 2.04176 38.6826
63.0957 69.0698 3188.58 1.0909 2.00917 39.2392
65.4636 71.6547 3374.41 1.09512 2.04567 40.1866
67.9204 74.3418 3571.87 1.09437 2.06865 41.0104
70.4693 77.1343 3780.93 1.09875 2.11288 41.6636
73.1139 80.0342 4001.3 1.09488 2.06091 42.3441
75.8578 83.036 4233.67 1.09358 2.05613 43.0246
78.7046 86.1466 4478.64 1.09312 2.094 43.2596
81.6582 89.3707 4734.19 1.09111 2.02302 44.0452
84.7227 92.7228 5004.14 1.09474 2.04369 44.7715
87.9023 96.2053 5288.84 1.09196 2.02001 45.1296
91.2011 99.8108 5586.59 1.09432 2.02787 45.8541
94.6237 103.558 5900.48 1.09636 2.05405 46.7412
98.1748 107.448 6232.44 1.09789 2.07426 47.7244
101.859 111.493 6584.11 1.09721 2.04795 48.3099
105.682 115.688 6953.45 1.09947 2.0745 48.9593
109.648 120.05 7341.8 1.10261 2.07519 50.1931
113.763 124.599 7754.88 1.111 2.13817 51.0888
118.032 129.336 8191.11 1.10717 2.12109 51.3746
122.462 134.231 8646.24 1.10541 2.10344 51.5356
127.057 139.305 9119.94 1.1015 2.09154 52.0726
131.826 144.544 9616.53 1.09944 2.09248 52.7651
136.773 149.976 10138.6 1.0973 2.04481 53.6664
141.906 155.63 10689.5 1.10149 2.07188 54.6459
147.231 161.507 11271.6 1.10562 2.13163 55.4802
152.757 167.613 11884.7 1.10247 2.11055 55.5781
158.489 173.915 12521.9 1.09667 2.06786 56.2463
164.437 180.44 13191 1.09924 2.07649 56.5082
170.608 187.201 13888.4 1.08887 1.99223 56.3482
177.011 194.187 14610 1.0958 2.06823 57.3208
183.654 201.463 15371.5 1.09741 2.09091 58.8613
190.546 209.008 16182.9 1.08886 2.0318 58.4935
197.697 216.784 17019.5 1.09334 2.06432 58.951
205.116 224.873 17894.2 1.08582 1.98074 59.8741
212.814 233.295 18816 1.09677 2.0878 61.2088
220.8 242.067 19793.7 1.09969 2.07242 61.5465
229.087 251.148 20813.7 1.09543 2.10016 62.1977
237.684 260.556 21883.1 1.09417 2.09151 63.876
246.604 270.344 23022.7 1.09614 2.0404 63.786
255.859 280.509 24203.3 1.10431 2.11211 64.5951
265.461 291.064 25443.8 1.09072 2.04372 64.7933
275.423 301.982 26734.8 1.09618 2.06336 65.1734
285.759 313.281 28082 1.08549 2.01103 64.9252
296.483 324.939 29474.6 1.08894 2.06563 65.6666
307.61 337.037 30935.9 1.09135 2.06968 66.0933
319.154 349.638 32461.8 1.08943 2.06198 66.6659
331.131 362.71 34058.8 1.09157 2.03391 66.855
343.558 376.322 35720.4 1.09281 2.03919 67.2516
356.451 390.384 37454.6 1.08744 2.03811 67.1296
369.828 404.968 39250.5 1.09474 2.08693 68.7993
383.707 420.184 41160.3 1.09039 2.04692 69.5455
398.107 435.884 43163.2 1.09262 2.05939 69.9603
413.048 452.258 45253.6 1.0995 2.10379 70.391
428.549 469.242 47435.9 1.08795 2.02111 70.4349
444.631 486.78 49701.5 1.0908 2.09772 70.5927
461.318 504.958 52057.4 1.09139 2.06802 70.3703
478.63 523.848 54493.9 1.0903 2.05292 70.1384
496.592 543.395 57013.6 1.09342 2.10976 70.5125
515.229 563.733 59641.8 1.0923 2.05513 70.7235
534.564 584.8 62376.8 1.09707 2.06548 72.1488
554.626 606.847 65271.6 1.09235 2.03328 72.9835
575.44 629.627 68309.8 1.09552 2.07221 74.873
597.035 653.321 71543.6 1.09722 2.08431 74.9826
619.441 677.888 74903.7 1.08896 2.02297 73.6412
642.688 703.259 78327.5 1.09757 2.07943 73.5043
666.807 729.721 81873.2 1.09827 2.0981 73.9681
691.831 757.032 85575.2 1.09359 2.10078 75.1492
717.794 785.39 89477.4 1.08868 2.04274 76.3775
744.732 814.807 93592.3 1.09198 2.04655 75.9099
772.681 845.275 97835.4 1.08939 2.05696 75.524
801.678 876.812 102215 1.08617 2.0106 75.9244
831.764 909.545 106784 1.0903 2.01993 76.5028
862.979 943.685 111560 1.09318 2.02761 76.9991
895.365 979.103 116547 1.09256 2.12695 76.8898
928.966 1015.8 121715 1.09357 2.11074 78.8431
963.829 1053.81 127212 1.08876 2.0654 79.8992
1000 1093.07 132992 1.08323 1.99627 80.1788
1037.53 1133.99 139010 1.08369 2.03809 79.5858
1076.47 1176.32 145208 1.0891 2.06582 78.6726
1116.86 1220.32 151564 1.09442 2.09378 78.8666
1158.78 1266.02 158175 1.0974 2.14168 79.7198
1202.26 1313.38 165109 1.08175 2.00818 79.7406
1247.38 1362.41 172305 1.08754 2.04827 80.2373
1294.2 1413.5 179817 1.08776 2.06757 80.3315
1342.76 1466.45 187620 1.08511 2.00664 80.2335
1393.16 1521.48 195706 1.08844 2.03312 79.3297
1445.44 1578.55 204001 1.09141 2.07376 79.5042
1499.68 1637.57 212627 1.09046 2.10731 79.2035
1555.97 1698.58 221542 1.08469 2.02905 79.7508
1614.36 1762.22 230856 1.08699 2.04737 81.3338
1674.94 1828.05 240711 1.08552 2.03068 80.9644
1737.8 1896.43 250889 1.08465 2.03316 81.9581
1803.02 1967.47 261580 1.09103 2.05849 82.7999
1870.68 2041.03 272785 1.09504 2.0724 81.6679
1940.89 2117.6 284252 1.08582 2.05149 80.1123
2013.72 2196.81 295922 1.08945 2.07126 81.7236
2089.3 2278.93 308274 1.09102 2.07805 83.5799
2167.7 2364.13 321381 1.08872 2.08584 86.3983
2249.05 2452.95 335438 1.08967 2.0716 84.3691
2333.46 2544.69 349680 1.08015 2.01135 80.4839
2421.03 2639.91 363776 1.08571 2.06032 79.2107
2511.89 2738.9 378170 1.08758 2.06364 81.3388
2606.15 2841.17 393505 1.08447 2.03127 78.5572
2703.96 2947.19 408871 1.07949 2.03282 78.6283
2805.43 3057.26 424829 1.08643 2.03863 81.7954
2910.72 3171.8 442053 1.08588 2.04138 81.6905
3019.95 3290.82 459899 1.09349 2.0672 81.1301
3133.29 3413.86 478289 1.08415 2.04149 81.1168
3250.87 3541.31 497366 1.08625 2.05801 81.2911
3372.87 3673.61 517201 1.08545 2.00696 82.3437
3499.45 3811.61 538047 1.0908 2.07613 83.9571
3630.78 3954.63 560099 1.09192 2.11294 85.8233
3767.04 4103.14 583487 1.09035 2.05849 83.7279
3908.41 4257.06 607160 1.09053 2.05623 85.3062
4055.09 4416.6 632185 1.08972 2.05915 83.1371
4207.27 4581.97 657489 1.08682 2.03609 85.3764
4365.16 4754.35 684449 1.08646 2.06014 78.2841
4528.98 4932.51 710098 1.08741 2.06092 82.9643
4698.94 5118.11 738300 1.09771 2.08961 87.1383
4875.28 5310.12 769032 1.09171 2.07275 85.4514
5058.25 5508.78 800301 1.08286 2.03022 83.5041
5248.07 5714.81 832004 1.08866 2.09985 79.6873
5445.03 5928.89 863393 1.08521 2.06842 81.4705
5649.37 6151.24 896689 1.08864 2.01578 81.3323
5861.38 6381.94 931176 1.08593 2.02654 82.6135
6081.35 6621.7 967521 1.08531 2.03083 83.097
6309.57 6870.15 1.00545e+06 1.09114 2.05215 85.3716
6546.36 7127.88 1.04588e+06 1.08299 2.02869 85.3214
6792.04 7394.77 1.0878e+06 1.09362 2.10107 84.0415
7046.93 7672.39 1.13065e+06 1.08954 2.07624 82.5621
7311.39 7959.31 1.17431e+06 1.08257 2.04651 77.6229
7585.78 8256.68 1.21691e+06 1.09082 2.08958 80.444
7870.46 8566.41 1.26271e+06 1.0848 2.05748 82.7873
8165.82 8887.88 1.31162e+06 1.08536 2.04299 79.7362
8472.27 9220.98 1.36049e+06 1.08799 2.05557 86.7485
8790.23 9566.95 1.41565e+06 1.08235 2.04817 83.6703
9120.11 9925.99 1.47086e+06 1.09253 2.12043 86.374
9462.37 10298 1.52998e+06 1.08186 2.02238 87.1572
9817.48 10683.6 1.59188e+06 1.08331 2.01573 82.0083
10185.9 11085.1 1.65231e+06 1.09102 2.02351 80.2201
10568.2 11502.8 1.71364e+06 1.09446 2.06401 79.7415
10964.8 11933.8 1.77689e+06 1.08896 2.07786 80.0265
11376.3 12382.2 1.84275e+06 1.08803 2.06406 82.3444
11803.2 12846.3 1.91306e+06 1.08359 2.06808 80.5403
12246.2 13327.6 1.98442e+06 1.08894 2.0831 81.9593
12705.7 13827.3 2.05975e+06 1.09581 2.07054 82.1108
13182.6 14346.5 2.13805e+06 1.08068 2.04927 83.2855
13677.3 14883.9 2.22046e+06 1.09075 2.03829 83.2651
14190.6 15443.7 2.30594e+06 1.08863 2.07095 84.3541
14723.1 16022.8 2.39578e+06 1.09303 2.04806 86.9704
15275.7 16623.7 2.49189e+06 1.08336 2.03227 82.0317
15848.9 17246 2.58595e+06 1.08642 2.00066 80.199
16443.7 17892.5 2.68135e+06 1.08573 2.0226 81.8755
17060.8 18564.5 2.7824e+06 1.08651 2.0531 77.612
17701.1 19261.1 2.88178e+06 1.08892 2.03071 85.3797
18365.4 19984.3 2.99522e+06 1.09537 2.08105 80.2526
19054.6 20734.5 3.10584e+06 1.08435 2.03247 86.5399
19769.7 21511.3 3.22961e+06 1.08877 2.03333 82.9592
20511.6 22318.7 3.35271e+06 1.08706 2.0391 84.3838
21281.4 23156.1 3.48262e+06 1.08724 2.07237 84.7293
22080 24025.3 3.61796e+06 1.09017 2.06085 87.1347
22908.7 24926.8 3.76237e+06 1.09322 2.097 82.9455
23768.4 25862 3.90499e+06 1.09389 2.06312 83.2139
24660.4 26832.8 4.05344e+06 1.09057 2.06323 82.1168
25585.9 27841.4 4.20543e+06 1.08658 2.06788 81.5861
26546.1 28886.2 4.36211e+06 1.08321 2.01355 79.4994
27542.3 29970.2 4.52051e+06 1.09278 2.09305 79.6627
28575.9 31096.9 4.68519e+06 1.0882 2.05896 81.0978
29648.3 32263.9 4.85913e+06 1.09239 2.10382 83.3182
30761 33474.9 5.04454e+06 1.08569 2.00256 82.7712
31915.4 34729.7 5.23564e+06 1.09069 2.08976 83.4991
33113.1 36031.8 5.43566e+06 1.09354 2.0888 86.7074
34355.8 37382.2 5.65116e+06 1.08311 2.0221 83.3498
35645.1 38785.4 5.86609e+06 1.08749 2.01349 84.2933
36982.8 40243.3 6.09161e+06 1.09062 2.08897 85.5373
38370.7 41754.8 6.32904e+06 1.08801 2.04095 80.1229
39810.7 43322 6.5598e+06 1.08785 2.02438 80.1853
41304.8 44947.9 6.7994e+06 1.0863 2.04747 84.5408
42854.9 46634.2 7.06149e+06 1.08624 2.04497 86.978
44463.1 48383.2 7.34126e+06 1.08464 2.09659 83.8114
46131.8 50198.9 7.62096e+06 1.08488 2.02544 82.1908
47863 52080.9 7.90555e+06 1.0922 2.08612 84.997
49659.2 54032.5 8.21089e+06 1.09027 2.06478 83.4714
51522.9 56061.9 8.52201e+06 1.08651 2.01472 86.013
53456.4 58164.2 8.85464e+06 1.08684 2.08284 83.5129
55462.6 60348.8 9.18971e+06 1.08221 2.05244 83.1763
57544 62609.2 9.53596e+06 1.08824 2.05692 84.3827
59703.5 64957.1 9.90042e+06 1.085 2.05898 82.6292
61944.1 67396.8 1.02707e+07 1.08573 2.02566 86.9429
64268.8 69930.2 1.06749e+07 1.08771 2.05521 82.4325
66680.7 72556.5 1.10726e+07 1.08616 2.03781 87.0219
69183.1 75279 1.15081e+07 1.0956 2.064 78.9808
71779.4 78105.6 1.19182e+07 1.08536 2.02251 85.7871
74473.2 81038.4 1.23804e+07 1.09217 2.11745 86.6384
77268.1 84080.7 1.28647e+07 1.09008 2.02934 81.4035
80167.8 87235.5 1.33368e+07 1.08896 2.08097 79.1969
83176.4 90511.5 1.38133e+07 1.09876 2.09272 84.0775
86297.9 93911.1 1.43382e+07 1.08454 2.06196 84.937
89536.5 97439.8 1.48884e+07 1.08529 2.00187 81.3656
92896.6 101094 1.54352e+07 1.09136 2.06801 85.4173
96382.9 104885 1.60307e+07 1.08157 2.01055 1.6392e+11
