0.00101743622327033 0 0.0010115794542599 0.00102329299228075
0.00102921757948005 0 0.00102329299228075 0.00103514216667934
0.00104113535736512 0 0.00103514216667934 0.0010471285480509
0.00105319113661409 0 0.0010471285480509 0.00105925372517729
0.00106538651520745 0 0.00105925372517729 0.00107151930523761
0.0010777231096294 0 0.00107151930523761 0.0010839269140212
0.00109020255508219 0 0.0010839269140212 0.00109647819614319
0.00110282650570279 0 0.00109647819614319 0.0011091748152624
0.00111559663478218 0 0.0011091748152624 0.00112201845430196
0.00112851463498714 0 0.00112201845430196 0.00113501081567232
0.0011415822185846 0 0.00113501081567232 0.00114815362149688
0.00115480111766861 0 0.00114815362149688 0.00116144861384034
0.00116817308438994 0 0.00116144861384034 0.00117489755493953
0.00118169989118827 0 0.00117489755493953 0.00118850222743702
0.00119538333102722 0 0.00118850222743702 0.00120226443461741
0.00120922521763189 0 0.00120226443461741 0.00121618600064637
0.00122322738572937 0 0.00121618600064637 0.00123026877081238
0.00123739169129188 0 0.00123026877081238 0.00124451461177139
0.00125172001178278 0 0.00124451461177139 0.00125892541179417
0.00126621424640541 0 0.00125892541179417 0.00127350308101666
0.0012808763163549 0 0.00127350308101666 0.00128824955169313
0.00129570816507272 0 0.00128824955169313 0.0013031667784523
0.00131071175850435 0 0.0013031667784523 0.00131825673855641
0.00132588908535987 0 0.00131825673855641 0.00133352143216332
0.00134124215737749 0 0.00133352143216332 0.00134896288259165
0.00135677300959029 0 0.00134896288259165 0.00136458313658892
0.0013724837005959 0 0.00136458313658892 0.00138038426460289
0.00138837631282941 0 0.00138038426460289 0.00139636836105594
0.00140445295283935 0 0.00139636836105594 0.00141253754462275
0.00142071575156693 0 0.00141253754462275 0.0014288939585111
0.00143716686462852 0 0.0014288939585111 0.00144543977074593
0.00145380847260132 0 0.00144543977074593 0.00146217717445672
0.00147064278131246 0 0.00146217717445672 0.00147910838816821
0.00148767202213132 0 0.00147910838816821 0.00149623565609443
0.00150489845226532 0 0.00149623565609443 0.00151356124843621
0.00152232435505912 0 0.00151356124843621 0.00153108746168203
0.00153995204029726 0 0.00153108746168203 0.00154881661891248
0.00155778384451032 0 0.00154881661891248 0.00156675107010815
0.00157582213128463 0 0.00156675107010815 0.00158489319246111
0.00159406929157558 0 0.00158489319246111 0.00160324539069004
0.00161252774402449 0 0.00160324539069004 0.00162181009735893
0.00163119993527923 0 0.00162181009735893 0.00164058977319954
0.00165008834031855 0 0.00164058977319954 0.00165958690743756
0.00166919546278006 0 0.00165958690743756 0.00167880401812256
0.00168852383529215 0 0.00167880401812256 0.00169824365246174
0.00170807601980967 0 0.00169824365246174 0.00171790838715759
0.00172785460795348 0 0.00171790838715759 0.00173780082874938
0.00174786222135403 0 0.00173780082874938 0.00175792361395869
0.00176810151199881 0 0.00175792361395869 0.00177827941003892
0.00178857516258386 0 0.00177827941003892 0.00179887091512879
0.00180928588686939 0 0.00179887091512879 0.00181970085860998
0.00183023643003947 0 0.00181970085860998 0.00184077200146896
0.00185142956906591 0 0.00184077200146896 0.00186208713666287
0.00187286811307633 0 0.00186208713666287 0.0018836490894898
0.00189455490372652 0 0.0018836490894898 0.00190546071796325
0.00191649281557709 0 0.00190546071796325 0.00192752491319094
0.00193868475647449 0 0.00192752491319094 0.00194984459975805
0.00196113366793645 0 0.00194984459975805 0.00197242273611485
0.00198384252554187 0 0.00197242273611485 0.00199526231496888
0.00200681433932522 0 0.00199526231496888 0.00201836636368156
0.00203005215417555 0 0.00201836636368156 0.00204173794466953
0.00205355905024003 0 0.00204173794466953 0.00206538015581053
0.00207733814333229 0 0.00206538015581053 0.00208929613085404
0.00210139258534534 0 0.00208929613085404 0.00211348903983665
0.00212572556466944 0 0.00211348903983665 0.00213796208950223
0.00215034030661463 0 0.00213796208950223 0.00216271852372702
0.00217524007383829 0 0.00216271852372702 0.00218776162394955
0.0022004281667776 0 0.00218776162394955 0.00221309470960564
0.00222590792408699 0 0.00221309470960564 0.00223872113856834
0.0022516827230807 0 0.00223872113856834 0.00226464430759306
0.00227775598018042 0 0.00226464430759306 0.00229086765276777
0.00230413115136813 0 0.00229086765276777 0.00231739464996848
0.0023308117326442 0 0.00231739464996848 0.00234422881531992
0.00235780126049079 0 0.00234422881531992 0.00237137370566166
0.00238510331234057 0 0.00237137370566166 0.00239883291901949
0.00241272150705096 0 0.00239883291901949 0.00242661009508242
0.00244065950538372 0 0.00242661009508242 0.00245470891568503
0.00246892101049029 0 0.00245470891568503 0.00248313310529557
0.00249750976840258 0 0.00248313310529557 0.00251188643150958
0.00252642956852944 0 0.00251188643150958 0.00254097270554931
0.00255568424415908 0 0.00254097270554931 0.00257039578276886
0.00258527767296707 0 0.00257039578276886 0.00260015956316528
0.00261521377753032 0 0.00260015956316528 0.00263026799189538
0.00264549652584711 0 0.00263026799189538 0.00266072505979881
0.00267612993186286 0 0.00266072505979881 0.00269153480392692
0.00270711805600241 0 0.00269153480392692 0.00272270130807791
0.00273846500570804 0 0.00272270130807791 0.00275422870333817
0.00277017493598397 0 0.00275422870333817 0.00278612116862977
0.00280225204994711 0 0.00278612116862977 0.00281838293126446
0.00283470059938418 0 0.00281838293126446 0.00285101826750391
0.00286752488531526 0 0.00285101826750391 0.00288403150312661
0.00290072925856389 0 0.00288403150312661 0.00291742701400117
0.00293431812033378 0 0.00291742701400117 0.00295120922666639
0.00296829592279217 0 0.00295120922666639 0.00298538261891796
0.00300266716965999 0 0.00298538261891796 0.00301995172040202
0.00303743641680876 0 0.00301995172040202 0.00305492111321551
0.00307260827286455 0 0.00305492111321551 0.0030902954325136
0.00310818739981877 0 0.0030902954325136 0.00312607936712395
0.00314417851364617 0 0.00312607936712395 0.00316227766016838
0.00318058638492989 0 0.00316227766016838 0.0031988951096914
0.00321741583949384 0 0.0031988951096914 0.00323593656929628
0.00325467175904233 0 0.00323593656929628 0.00327340694878838
0.00329235908180714 0 0.00327340694878838 0.00331131121482591
0.00333048280320209 0 0.00331131121482591 0.00334965439157828
0.00336904797648515 0 0.00334965439157828 0.00338844156139203
0.00340805971342826 0 0.00338844156139203 0.0034276778654645
0.00344752318499491 0 0.0034276778654645 0.00346736850452532
0.0034874436220255 0 0.00346736850452532 0.00350751873952569
0.00352782631593072 0 0.00350751873952569 0.00354813389233575
0.0035686766193929 0 0.00354813389233575 0.00358921934645005
0.00360999994707552 0 0.00358921934645005 0.00363078054770101
0.00365180177634093 0 0.00363078054770101 0.00367282300498084
0.00369408764797629 0 0.00367282300498084 0.00371535229097173
0.00373686316692808 0 0.00371535229097173 0.00375837404288443
0.00378013400304504 0 0.00375837404288443 0.00380189396320561
0.00382390589182957 0 0.00380189396320561 0.00384591782045353
0.00386818463519817 0 0.00384591782045353 0.00389045144994282
0.00391297610225028 0 0.00389045144994282 0.00393550075455778
0.00395828623004636 0 0.00393550075455778 0.00398107170553497
0.00400412102439479 0 0.00398107170553497 0.0040271703432546
0.00405048656064786 0 0.0040271703432546 0.00407380277804113
0.00409738898450723 0 0.00407380277804113 0.00412097519097331
0.00414483451283833 0 0.00412097519097331 0.00416869383470336
0.0041928294344946 0 0.00416869383470336 0.00421696503428581
0.00424138011115088 0 0.00421696503428581 0.00426579518801594
0.00429049297814678 0 0.00426579518801594 0.00431519076827764
0.00434017454533965 0 0.00431519076827764 0.00436515832240165
0.0043904313979674 0 0.00436515832240165 0.00441570447353313
0.00444127019752138 0 0.00441570447353313 0.00446683592150964
0.00449269768262944 0 0.00446683592150964 0.00451855944374923
0.00454472066994899 0 0.00451855944374923 0.00457088189614874
0.00459734605507068 0 0.00457088189614874 0.0046238102139926
0.00465058081343228 0 0.0046238102139926 0.00467735141287197
0.00470443200124339 0 0.00467735141287197 0.0047315125896148
0.0047589067564206 0 0.0047315125896148 0.00478630092322639
0.0048140122995337 0 0.00478630092322639 0.004841723675841
0.00486975593476274 0 0.004841723675841 0.00489778819368447
0.00492614505086619 0 0.00489778819368447 0.0049545019080479
0.0049831871221603 0 0.0049545019080479 0.00501187233627272
0.00504088970950988 0 0.00501187233627272 0.00506990708274703
0.00509926046133036 0 0.00506990708274703 0.00512861383991365
0.00515830711460163 0 0.00512861383991365 0.00518800038928961
0.00521803749589367 0 0.00518800038928961 0.00524807460249772
0.0052784595224038 0 0.00524807460249772 0.00530884444230988
0.00533958120300621 0 0.00530884444230988 0.00537031796370253
0.00540141063931343 0 0.00537031796370253 0.00543250331492433
0.0054639560267503 0 0.00543250331492433 0.00549540873857625
0.00552722565564013 0 0.00549540873857625 0.00555904257270405
0.00559122791230376 0 0.00555904257270405 0.00562341325190348
0.00565597128017094 0 0.00562341325190348 0.0056885293084384
0.00572146434090499 0 0.0056885293084384 0.00575439937337157
0.00578771577554015 0 0.00575439937337157 0.0058210321777087
0.00585473436563229 0 0.0058210321777087 0.00588843655355588
0.00592252899442301 0 0.00588843655355588 0.00595662143529009
0.00599110864801684 0 0.00595662143529009 0.00602559586074358
0.00606048241657264 0 0.00602559586074358 0.0060953689724017
0.00613065949550827 0 0.0060953689724017 0.00616595001861482
0.00620164918671951 0 0.00616595001861482 0.00623734835482419
0.00627346089981307 0 0.00623734835482419 0.00630957344480194
0.00634610415335369 0 0.00630957344480194 0.00638263486190549
0.00641958857612601 0 0.00638263486190549 0.00645654229034655
0.00649392390841064 0 0.00645654229034655 0.00653130552647473
0.00656912000327535 0 0.00653130552647473 0.00660693448007598
0.00664518682788106 0 0.00660693448007598 0.00668343917568615
0.00672213446480297 0 0.00668343917568615 0.00676082975391982
0.00679997311336707 0 0.00676082975391982 0.00683911647281429
0.00687871309100184 0 0.00683911647281429 0.00691830970918938
0.00695836483460606 0 0.00691830970918938 0.00699841996002272
0.00703893890193207 0 0.00699841996002272 0.00707945784384137
0.00712044597298521 0 0.00707945784384137 0.007161434102129
0.00720289685143946 0 0.007161434102129 0.00724435960074988
0.00728630246606946 0 0.00724435960074988 0.00732824533138906
0.00737067387219911 0 0.00732824533138906 0.00741310241300919
0.00745602225316688 0 0.00741310241300919 0.00749894209332457
0.00754235892180821 0 0.00749894209332457 0.00758577575029184
0.00762969532195501 0 0.00758577575029184 0.00767361489361818
0.00771804302995257 0 0.00767361489361818 0.00776247116628692
0.00780741375619384 0 0.00776247116628692 0.00785235634610071
0.00789781934667177 0 0.00785235634610071 0.00794328234724282
0.00798927178454948 0 0.00794328234724282 0.00803526122185616
0.00808178319174857 0 0.00803526122185616 0.00812830516164098
0.00817536583055586 0 0.00812830516164098 0.0082224264994707
0.00827003210524871 0 0.0082224264994707 0.0083176377110267
0.00836579456373932 0 0.0083176377110267 0.00841395141645196
0.00846266589923786 0 0.00841395141645196 0.00851138038202378
0.00856065895193491 0 0.00851138038202378 0.00860993752184602
0.00865978671070342 0 0.00860993752184602 0.00870963589956078
0.00876006231482049 0 0.00870963589956078 0.00881048873008016
0.00886149905570879 0 0.00881048873008016 0.00891250938133747
0.00896411037869849 0 0.00891250938133747 0.00901571137605959
0.00906790988480932 0 0.00901571137605959 0.00912010839355912
0.00917291133255337 0 0.00912010839355912 0.00922571427154762
0.00927912863975877 0 0.00922571427154762 0.00933254300796992
0.00938657588541458 0 0.00933254300796992 0.00944060876285924
0.00949526731153682 0 0.00944060876285924 0.00954992586021438
0.00960521732505626 0 0.00954992586021438 0.00966050878989811
0.00971644049972811 0 0.00966050878989811 0.00977237220955809
0.00982895157806374 0 0.00977237220955809 0.0098855309465694
0.00994276547328468 0 0.0098855309465694 0.01
0.0100578972712995 0 0.01 0.010115794542599
0.0101743622327033 0 0.010115794542599 0.0102329299228075
0.0102921757948005 0 0.0102329299228075 0.0103514216667934
0.0104113535736512 0 0.0103514216667934 0.010471285480509
0.0105319113661409 0 0.010471285480509 0.0105925372517729
0.0106538651520745 0 0.0105925372517729 0.0107151930523761
0.0107772310962941 0 0.0107151930523761 0.010839269140212
0.0109020255508219 0 0.010839269140212 0.0109647819614319
0.0110282650570279 0 0.0109647819614319 0.011091748152624
0.0111559663478218 0 0.011091748152624 0.0112201845430196
0.0112851463498714 0 0.0112201845430196 0.0113501081567232
0.011415822185846 0 0.0113501081567232 0.0114815362149688
0.0115480111766861 0 0.0114815362149688 0.0116144861384034
0.0116817308438994 0 0.0116144861384034 0.0117489755493953
0.0118169989118827 0 0.0117489755493953 0.0118850222743702
0.0119538333102722 0 0.0118850222743702 0.0120226443461741
0.0120922521763189 0 0.0120226443461741 0.0121618600064637
0.0122322738572937 0 0.0121618600064637 0.0123026877081238
0.0123739169129188 0 0.0123026877081238 0.0124451461177139
0.0125172001178278 0 0.0124451461177139 0.0125892541179417
0.0126621424640541 0 0.0125892541179417 0.0127350308101666
0.012808763163549 0 0.0127350308101666 0.0128824955169313
0.0129570816507272 0 0.0128824955169313 0.013031667784523
0.0131071175850435 0 0.013031667784523 0.0131825673855641
0.0132588908535987 0 0.0131825673855641 0.0133352143216332
0.0134124215737749 0 0.0133352143216332 0.0134896288259165
0.0135677300959029 0 0.0134896288259165 0.0136458313658893
0.0137248370059591 0 0.0136458313658893 0.0138038426460289
0.0138837631282941 0 0.0138038426460289 0.0139636836105594
0.0140445295283935 0 0.0139636836105594 0.0141253754462275
0.0142071575156693 0 0.0141253754462275 0.014288939585111
0.0143716686462852 0 0.014288939585111 0.0144543977074593
0.0145380847260132 0 0.0144543977074593 0.0146217717445672
0.0147064278131246 0 0.0146217717445672 0.0147910838816821
0.0148767202213132 0 0.0147910838816821 0.0149623565609443
0.0150489845226532 0 0.0149623565609443 0.0151356124843621
0.0152232435505912 0 0.0151356124843621 0.0153108746168203
0.0153995204029726 0 0.0153108746168203 0.0154881661891248
0.0155778384451032 0 0.0154881661891248 0.0156675107010815
0.0157582213128463 0 0.0156675107010815 0.0158489319246111
0.0159406929157558 0 0.0158489319246111 0.0160324539069004
0.0161252774402449 0 0.0160324539069004 0.0162181009735893
0.0163119993527923 0 0.0162181009735893 0.0164058977319954
0.0165008834031855 0 0.0164058977319954 0.0165958690743756
0.0166919546278006 0 0.0165958690743756 0.0167880401812256
0.0168852383529215 0 0.0167880401812256 0.0169824365246174
0.0170807601980967 0 0.0169824365246174 0.0171790838715759
0.0172785460795348 0 0.0171790838715759 0.0173780082874938
0.0174786222135403 0 0.0173780082874938 0.0175792361395869
0.0176810151199881 0 0.0175792361395869 0.0177827941003892
0.0178857516258386 0 0.0177827941003892 0.0179887091512879
0.0180928588686939 0 0.0179887091512879 0.0181970085860998
0.0183023643003947 0 0.0181970085860998 0.0184077200146896
0.0185142956906591 0 0.0184077200146896 0.0186208713666287
0.0187286811307633 0 0.0186208713666287 0.018836490894898
0.0189455490372652 0 0.018836490894898 0.0190546071796325
0.0191649281557709 0 0.0190546071796325 0.0192752491319094
0.0193868475647449 0 0.0192752491319094 0.0194984459975805
0.0196113366793645 0 0.0194984459975805 0.0197242273611485
0.0198384252554187 0 0.0197242273611485 0.0199526231496888
0.0200681433932522 0 0.0199526231496888 0.0201836636368156
0.0203005215417555 0 0.0201836636368156 0.0204173794466953
0.0205355905024003 0 0.0204173794466953 0.0206538015581053
0.0207733814333228 0 0.0206538015581053 0.0208929613085404
0.0210139258534534 0 0.0208929613085404 0.0211348903983665
0.0212572556466944 0 0.0211348903983665 0.0213796208950223
0.0215034030661463 0 0.0213796208950223 0.0216271852372702
0.0217524007383829 0 0.0216271852372702 0.0218776162394955
0.022004281667776 0 0.0218776162394955 0.0221309470960564
0.0222590792408699 0 0.0221309470960564 0.0223872113856834
0.022516827230807 0 0.0223872113856834 0.0226464430759306
0.0227775598018042 0 0.0226464430759306 0.0229086765276777
0.0230413115136813 0 0.0229086765276777 0.0231739464996848
0.023308117326442 0 0.0231739464996848 0.0234422881531992
0.0235780126049079 0 0.0234422881531992 0.0237137370566166
0.0238510331234057 0 0.0237137370566166 0.0239883291901949
0.0241272150705095 0 0.0239883291901949 0.0242661009508241
0.0244065950538372 0 0.0242661009508241 0.0245470891568503
0.024689210104903 0 0.0245470891568503 0.0248313310529557
0.0249750976840258 0 0.0248313310529557 0.0251188643150959
0.0252642956852944 0 0.0251188643150959 0.025409727055493
0.0255568424415908 0 0.025409727055493 0.0257039578276886
0.0258527767296707 0 0.0257039578276886 0.0260015956316527
0.0261521377753033 0 0.0260015956316527 0.0263026799189538
0.026454965258471 0 0.0263026799189538 0.0266072505979881
0.0267612993186286 0 0.0266072505979881 0.0269153480392692
0.0270711805600241 0 0.0269153480392692 0.0272270130807791
0.0273846500570804 0 0.0272270130807791 0.0275422870333817
0.0277017493598396 0 0.0275422870333817 0.0278612116862977
0.0280225204994711 0 0.0278612116862977 0.0281838293126445
0.0283470059938418 0 0.0281838293126445 0.0285101826750391
0.0286752488531526 0 0.0285101826750391 0.0288403150312661
0.0290072925856389 0 0.0288403150312661 0.0291742701400117
0.0293431812033379 0 0.0291742701400117 0.0295120922666639
0.0296829592279217 0 0.0295120922666639 0.0298538261891796
0.0300266716966 0 0.0298538261891796 0.0301995172040202
0.0303743641680878 0 0.0301995172040202 0.0305492111321551
0.0307260827286454 0 0.0305492111321551 0.030902954325136
0.0310818739981876 0 0.030902954325136 0.0312607936712395
0.0314417851364617 0 0.0312607936712395 0.0316227766016839
0.0318058638492989 0 0.0316227766016839 0.0319889510969139
0.0321741583949384 0 0.0319889510969139 0.0323593656929627
0.0325467175904234 0 0.0323593656929627 0.0327340694878838
0.0329235908180716 0 0.0327340694878838 0.0331131121482592
0.0333048280320209 0 0.0331131121482592 0.0334965439157827
0.0336904797648514 0 0.0334965439157827 0.0338844156139202
0.0340805971342827 0 0.0338844156139202 0.034276778654645
0.0344752318499491 0 0.034276778654645 0.0346736850452532
0.034874436220255 0 0.0346736850452532 0.0350751873952567
0.0352782631593072 0 0.0350751873952567 0.0354813389233576
0.035686766193929 0 0.0354813389233576 0.0358921934645005
0.0360999994707552 0 0.0358921934645005 0.0363078054770102
0.0365180177634094 0 0.0363078054770102 0.0367282300498085
0.0369408764797629 0 0.0367282300498085 0.0371535229097173
0.0373686316692807 0 0.0371535229097173 0.0375837404288445
0.0378013400304503 0 0.0375837404288445 0.0380189396320562
0.0382390589182956 0 0.0380189396320562 0.0384591782045355
0.0386818463519818 0 0.0384591782045355 0.038904514499428
0.0391297610225029 0 0.038904514499428 0.0393550075455776
0.0395828623004637 0 0.0393550075455776 0.0398107170553498
0.0400412102439479 0 0.0398107170553498 0.0402717034325458
0.0405048656064787 0 0.0402717034325458 0.0407380277804114
0.040973889845072 0 0.0407380277804114 0.041209751909733
0.0414483451283833 0 0.041209751909733 0.0416869383470334
0.0419282943449458 0 0.0416869383470334 0.0421696503428582
0.0424138011115088 0 0.0421696503428582 0.0426579518801593
0.0429049297814679 0 0.0426579518801593 0.0431519076827765
0.0434017454533966 0 0.0431519076827765 0.0436515832240166
0.0439043139796738 0 0.0436515832240166 0.0441570447353312
0.0444127019752138 0 0.0441570447353312 0.0446683592150964
0.0449269768262943 0 0.0446683592150964 0.0451855944374922
0.0454472066994898 0 0.0451855944374922 0.0457088189614875
0.0459734605507069 0 0.0457088189614875 0.046238102139926
0.0465058081343228 0 0.046238102139926 0.0467735141287199
0.047044320012434 0 0.0467735141287199 0.047315125896148
0.047589067564206 0 0.047315125896148 0.0478630092322637
0.0481401229953369 0 0.0478630092322637 0.0484172367584099
0.0486975593476273 0 0.0484172367584099 0.0489778819368446
0.0492614505086619 0 0.0489778819368446 0.049545019080479
0.0498318712216031 0 0.049545019080479 0.0501187233627273
0.0504088970950987 0 0.0501187233627273 0.0506990708274705
0.0509926046133034 0 0.0506990708274705 0.0512861383991365
0.0515830711460162 0 0.0512861383991365 0.0518800038928961
0.0521803749589367 0 0.0518800038928961 0.0524807460249773
0.052784595224038 0 0.0524807460249773 0.053088444423099
0.053395812030062 0 0.053088444423099 0.0537031796370252
0.0540141063931342 0 0.0537031796370252 0.0543250331492432
0.0546395602675028 0 0.0543250331492432 0.0549540873857624
0.0552722565564014 0 0.0549540873857624 0.0555904257270405
0.0559122791230377 0 0.0555904257270405 0.0562341325190348
0.0565597128017095 0 0.0562341325190348 0.0568852930843843
0.0572146434090498 0 0.0568852930843843 0.0575439937337157
0.0578771577554014 0 0.0575439937337157 0.0582103217770872
0.0585473436563229 0 0.0582103217770872 0.058884365535559
0.05922528994423 0 0.058884365535559 0.059566214352901
0.0599110864801684 0 0.059566214352901 0.0602559586074358
0.0606048241657264 0 0.0602559586074358 0.060953689724017
0.0613065949550826 0 0.060953689724017 0.0616595001861482
0.062016491867195 0 0.0616595001861482 0.0623734835482421
0.0627346089981307 0 0.0623734835482421 0.0630957344480194
0.063461041533537 0 0.0630957344480194 0.063826348619055
0.0641958857612603 0 0.063826348619055 0.0645654229034654
0.0649392390841064 0 0.0645654229034654 0.0653130552647472
0.0656912000327533 0 0.0653130552647472 0.0660693448007595
0.0664518682788105 0 0.0660693448007595 0.0668343917568616
0.0672213446480299 0 0.0668343917568616 0.0676082975391983
0.0679997311336705 0 0.0676082975391983 0.0683911647281431
0.0687871309100183 0 0.0683911647281431 0.0691830970918935
0.0695836483460604 0 0.0691830970918935 0.0699841996002275
0.0703893890193205 0 0.0699841996002275 0.0707945784384138
0.0712044597298521 0 0.0707945784384138 0.0716143410212904
0.0720289685143945 0 0.0716143410212904 0.0724435960074991
0.0728630246606947 0 0.0724435960074991 0.0732824533138903
0.073706738721991 0 0.0732824533138903 0.0741310241300919
0.0745602225316686 0 0.0741310241300919 0.0749894209332458
0.0754235892180821 0 0.0749894209332458 0.0758577575029183
0.0762969532195503 0 0.0758577575029183 0.076736148936182
0.0771804302995254 0 0.076736148936182 0.0776247116628692
0.078074137561938 0 0.0776247116628692 0.0785235634610073
0.0789781934667176 0 0.0785235634610073 0.0794328234724284
0.0798927178454951 0 0.0794328234724284 0.0803526122185617
0.0808178319174858 0 0.0803526122185617 0.0812830516164099
0.0817536583055585 0 0.0812830516164099 0.0822242649947071
0.082700321052487 0 0.0822242649947071 0.0831763771102672
0.0836579456373931 0 0.0831763771102672 0.0841395141645194
0.0846266589923788 0 0.0841395141645194 0.0851138038202377
0.085606589519349 0 0.0851138038202377 0.08609937521846
0.0865978671070342 0 0.08609937521846 0.0870963589956081
0.0876006231482045 0 0.0870963589956081 0.0881048873008013
0.0886149905570879 0 0.0881048873008013 0.0891250938133747
0.0896411037869853 0 0.0891250938133747 0.0901571137605958
0.0906790988480933 0 0.0901571137605958 0.091201083935591
0.0917291133255337 0 0.091201083935591 0.0922571427154762
0.0927912863975877 0 0.0922571427154762 0.0933254300796992
0.0938657588541457 0 0.0933254300796992 0.0944060876285923
0.0949526731153679 0 0.0944060876285923 0.0954992586021437
0.0960521732505626 0 0.0954992586021437 0.0966050878989814
0.0971644049972813 0 0.0966050878989814 0.0977237220955811
0.0982895157806373 0 0.0977237220955811 0.0988553094656941
0.0994276547328472 0 0.0988553094656941 0.0999999999999998
0.100578972712995 0 0.0999999999999998 0.10115794542599
0.101743622327033 0 0.10115794542599 0.102329299228075
0.102921757948005 0 0.102329299228075 0.103514216667934
0.104113535736512 0 0.103514216667934 0.10471285480509
0.105319113661409 0 0.10471285480509 0.105925372517729
0.106538651520745 0 0.105925372517729 0.107151930523761
0.107772310962941 0 0.107151930523761 0.10839269140212
0.109020255508219 0 0.10839269140212 0.109647819614319
0.110282650570279 0 0.109647819614319 0.11091748152624
0.111559663478218 0 0.11091748152624 0.112201845430196
0.112851463498714 0 0.112201845430196 0.113501081567232
0.11415822185846 0 0.113501081567232 0.114815362149688
0.115480111766861 0 0.114815362149688 0.116144861384034
0.116817308438994 0 0.116144861384034 0.117489755493953
0.118169989118827 0 0.117489755493953 0.118850222743702
0.119538333102722 0 0.118850222743702 0.120226443461741
0.120922521763189 0 0.120226443461741 0.121618600064637
0.122322738572937 0 0.121618600064637 0.123026877081238
0.123739169129188 0 0.123026877081238 0.124451461177138
0.125172001178278 0 0.124451461177138 0.125892541179417
0.126621424640541 0 0.125892541179417 0.127350308101666
0.12808763163549 0 0.127350308101666 0.128824955169313
0.129570816507272 0 0.128824955169313 0.13031667784523
0.131071175850435 0 0.13031667784523 0.131825673855641
0.132588908535987 0 0.131825673855641 0.133352143216332
0.134124215737749 0 0.133352143216332 0.134896288259165
0.135677300959029 0 0.134896288259165 0.136458313658892
0.13724837005959 0 0.136458313658892 0.138038426460288
0.138837631282941 0 0.138038426460288 0.139636836105594
0.140445295283935 0 0.139636836105594 0.141253754462275
0.142071575156693 0 0.141253754462275 0.14288939585111
0.143716686462852 0 0.14288939585111 0.144543977074593
0.145380847260132 0 0.144543977074593 0.146217717445672
0.147064278131246 0 0.146217717445672 0.147910838816821
0.148767202213132 0 0.147910838816821 0.149623565609443
0.150489845226532 0 0.149623565609443 0.151356124843621
0.152232435505912 0 0.151356124843621 0.153108746168203
0.153995204029726 0 0.153108746168203 0.154881661891248
0.155778384451032 0 0.154881661891248 0.156675107010815
0.157582213128463 0 0.156675107010815 0.158489319246111
0.159406929157558 0 0.158489319246111 0.160324539069004
0.161252774402449 0 0.160324539069004 0.162181009735893
0.163119993527924 0 0.162181009735893 0.164058977319954
0.165008834031855 0 0.164058977319954 0.165958690743756
0.166919546278006 0 0.165958690743756 0.167880401812256
0.168852383529215 0 0.167880401812256 0.169824365246174
0.170807601980967 0 0.169824365246174 0.171790838715759
0.172785460795348 0 0.171790838715759 0.173780082874938
0.174786222135403 0 0.173780082874938 0.175792361395869
0.176810151199881 0 0.175792361395869 0.177827941003892
0.178857516258386 0 0.177827941003892 0.179887091512879
0.180928588686939 0 0.179887091512879 0.181970085860998
0.183023643003947 0 0.181970085860998 0.184077200146896
0.185142956906591 0 0.184077200146896 0.186208713666287
0.187286811307633 0 0.186208713666287 0.18836490894898
0.189455490372652 0 0.18836490894898 0.190546071796325
0.191649281557709 0 0.190546071796325 0.192752491319093
0.193868475647449 0 0.192752491319093 0.194984459975804
0.196113366793645 0 0.194984459975804 0.197242273611485
0.198384252554187 0 0.197242273611485 0.199526231496888
0.200681433932522 0 0.199526231496888 0.201836636368156
0.203005215417555 0 0.201836636368156 0.204173794466953
0.205355905024003 0 0.204173794466953 0.206538015581053
0.207733814333228 0 0.206538015581053 0.208929613085404
0.210139258534534 0 0.208929613085404 0.211348903983665
0.212572556466944 0 0.211348903983665 0.213796208950223
0.215034030661463 0 0.213796208950223 0.216271852372702
0.217524007383829 0 0.216271852372702 0.218776162394955
0.220042816677759 0 0.218776162394955 0.221309470960564
0.222590792408699 0 0.221309470960564 0.223872113856834
0.22516827230807 0 0.223872113856834 0.226464430759306
0.227775598018042 0 0.226464430759306 0.229086765276777
0.230413115136813 0 0.229086765276777 0.231739464996848
0.23308117326442 0 0.231739464996848 0.234422881531992
0.235780126049079 0 0.234422881531992 0.237137370566164
0.238510331234057 0 0.237137370566164 0.239883291901949
0.241272150705094 0 0.239883291901949 0.242661009508242
0.244065950538372 0 0.242661009508242 0.245470891568503
0.24689210104903 0 0.245470891568503 0.248313310529557
0.249750976840258 0 0.248313310529557 0.251188643150958
0.252642956852944 0 0.251188643150958 0.25409727055493
0.255568424415909 0 0.25409727055493 0.257039578276886
0.258527767296706 0 0.257039578276886 0.260015956316527
0.261521377753033 0 0.260015956316527 0.263026799189538
0.26454965258471 0 0.263026799189538 0.266072505979881
0.267612993186287 0 0.266072505979881 0.269153480392692
0.27071180560024 0 0.269153480392692 0.27227013080779
0.273846500570804 1.73009708208337e-06 0.27227013080779 0.275422870333817
0.277017493598397 0 0.275422870333817 0.278612116862977
0.280225204994711 5.63571754826305e-07 0.278612116862977 0.281838293126445
0.283470059938417 5.57120602294783e-07 0.281838293126445 0.285101826750392
0.286752488531526 5.50743295495649e-07 0.285101826750392 0.288403150312661
0.290072925856389 2.72219494561872e-06 0.288403150312661 0.291742701400117
0.293431812033378 1.07641369510042e-06 0.291742701400117 0.29512092266664
0.296829592279217 1.59613813413393e-06 0.29512092266664 0.298538261891796
0.300266716965999 1.57786729199809e-06 0.298538261891796 0.301995172040201
0.303743641680875 1.55980559446278e-06 0.301995172040201 0.305492111321551
0.307260827286455 3.08390129493829e-06 0.305492111321551 0.309029543251359
0.310818739981877 3.55670019684934e-06 0.309029543251359 0.312607936712396
0.314417851364617 3.01370313116778e-06 0.312607936712396 0.316227766016837
0.318058638492989 2.48267129724431e-06 0.316227766016837 0.31988951096914
0.321741583949383 2.45425239390683e-06 0.31988951096914 0.323593656929628
0.325467175904233 2.42615879906578e-06 0.323593656929628 0.327340694878838
0.329235908180714 5.27645093568006e-06 0.327340694878838 0.331131121482591
0.33304828032021 2.84511921887584e-06 0.331131121482591 0.334965439157828
0.336904797648515 7.50013708930107e-06 0.334965439157828 0.338844156139203
0.340805971342825 9.73124739559771e-06 0.338844156139203 0.34276778654645
0.344752318499491 1.09941196889034e-05 0.34276778654645 0.346736850452532
0.34874436220255 1.13211156682231e-05 0.346736850452532 0.350751873952568
0.352782631593072 1.29821677573966e-05 0.350751873952568 0.354813389233576
0.356867661939291 1.6373855108326e-05 0.354813389233576 0.358921934645004
0.360999994707553 2.88730826800209e-05 0.358921934645004 0.363078054770102
0.365180177634094 3.15698180636412e-05 0.363078054770102 0.367282300498085
0.369408764797629 4.4033828198505e-05 0.367282300498085 0.371535229097172
0.373686316692808 4.73333498946047e-05 0.371535229097172 0.375837404288444
0.378013400304503 6.7262823683267e-05 0.375837404288444 0.380189396320561
0.382390589182957 8.01218463754469e-05 0.380189396320561 0.384591782045354
0.386818463519816 9.75769232216192e-05 0.384591782045354 0.389045144994282
0.391297610225029 0.000128344227091511 0.389045144994282 0.393550075455778
0.395828623004637 0.000146425017026003 0.393550075455778 0.398107170553497
0.400412102439478 0.000186556488985777 0.398107170553497 0.40271703432546
0.405048656064786 0.000238226696931964 0.40271703432546 0.407380277804113
0.409738898450721 0.000293314731562659 0.407380277804113 0.41209751909733
0.414483451283833 0.000357016928912311 0.41209751909733 0.416869383470335
0.41928294344946 0.000458394921167632 0.416869383470335 0.421696503428582
0.424138011115088 0.000573788523645555 0.421696503428582 0.426579518801593
0.429049297814679 0.000702307957657229 0.426579518801593 0.431519076827766
0.434017454533966 0.000854372599166271 0.431519076827766 0.436515832240166
0.439043139796738 0.00107732328249711 0.436515832240166 0.441570447353313
0.444127019752138 0.00131354849161523 0.441570447353313 0.446683592150962
0.449269768262944 0.00165741366819857 0.446683592150962 0.451855944374922
0.454472066994898 0.00198802191120374 0.451855944374922 0.457088189614874
0.459734605507068 0.00248191595189523 0.457088189614874 0.46238102139926
0.46505808134323 0.00303589493600336 0.46238102139926 0.467735141287198
0.470443200124338 0.00367824692517562 0.467735141287198 0.47315125896148
0.475890675642061 0.00451224130251585 0.47315125896148 0.478630092322639
0.48140122995337 0.00549823417913283 0.478630092322639 0.484172367584099
0.486975593476273 0.00656743363116066 0.484172367584099 0.489778819368446
0.492614505086619 0.00792497106739111 0.489778819368446 0.495450190804789
0.498318712216031 0.00956527000658182 0.495450190804789 0.501187233627271
0.504088970950988 0.0114357823130389 0.501187233627271 0.506990708274705
0.509926046133034 0.0136484211379735 0.506990708274705 0.512861383991364
0.515830711460162 0.0163364203941479 0.512861383991364 0.518800038928961
0.521803749589367 0.0194247616474759 0.518800038928961 0.524807460249774
0.527845952240382 0.0231280996203933 0.524807460249774 0.53088444423099
0.53395812030062 0.0272197016078419 0.53088444423099 0.537031796370252
0.540141063931344 0.0322157134306413 0.537031796370252 0.543250331492432
0.546395602675028 0.03748975770291 0.543250331492432 0.549540873857623
0.552722565564013 0.0442891890410211 0.549540873857623 0.555904257270405
0.559122791230378 0.0517519642846538 0.555904257270405 0.562341325190348
0.565597128017096 0.0600915884798506 0.562341325190348 0.568852930843841
0.572146434090499 0.0697618589943922 0.568852930843841 0.575439937337158
0.578771577554015 0.0811606788902456 0.575439937337158 0.582103217770872
0.585473436563229 0.0938145188859367 0.582103217770872 0.588843655355589
0.5922528994423 0.108285801158015 0.588843655355589 0.595662143529012
0.599110864801682 0.124033587787063 0.595662143529012 0.602559586074357
0.606048241657263 0.142333026947111 0.602559586074357 0.609536897240169
0.613065949550824 0.162418571873482 0.609536897240169 0.616595001861483
0.620164918671952 0.184399764233002 0.616595001861483 0.623734835482418
0.627346089981307 0.20925364912692 0.623734835482418 0.630957344480194
0.634610415335373 0.236988907975934 0.630957344480194 0.638263486190548
0.641958857612601 0.266613869135753 0.638263486190548 0.645654229034655
0.649392390841065 0.299156513939108 0.645654229034655 0.653130552647473
0.656912000327536 0.334764286978826 0.653130552647473 0.660693448007597
0.664518682788106 0.373607727297984 0.660693448007597 0.668343917568614
0.672213446480299 0.415136979750725 0.668343917568614 0.676082975391983
0.679997311336706 0.461561163900808 0.676082975391983 0.683911647281429
0.687871309100182 0.509549483950313 0.683911647281429 0.691830970918937
0.695836483460605 0.561678431061122 0.691830970918937 0.699841996002276
0.703893890193206 0.61657313177137 0.699841996002276 0.707945784384137
0.71204459729852 0.674771865448901 0.707945784384137 0.716143410212902
0.720289685143945 0.73617580201284 0.716143410212902 0.72443596007499
0.728630246606946 0.800108557173063 0.72443596007499 0.732824533138904
0.73706738721991 0.867460038305895 0.732824533138904 0.741310241300918
0.745602225316688 0.936249356466247 0.741310241300918 0.749894209332454
0.75423589218082 1.00841522603589 0.749894209332454 0.758577575029184
0.762969532195503 1.08206387308699 0.758577575029184 0.767361489361819
0.771804302995255 1.15720811724076 0.767361489361819 0.776247116628691
0.780741375619384 1.23336279232337 0.776247116628691 0.785235634610073
0.789781934667175 1.30899930968334 0.785235634610073 0.794328234724281
0.798927178454947 1.38565118239802 0.794328234724281 0.803526122185616
0.808178319174857 1.46075069815751 0.803526122185616 0.812830516164098
0.817536583055585 1.53642312502625 0.812830516164098 0.822242649947072
0.82700321052487 1.60901562714204 0.822242649947072 0.831763771102672
0.836579456373934 1.68245591757594 0.831763771102672 0.841395141645195
0.846266589923786 1.75074013152986 0.841395141645195 0.851138038202377
0.856065895193486 1.81425885490248 0.851138038202377 0.860993752184599
0.865978671070341 1.87582791502359 0.860993752184599 0.870963589956081
0.87600623148205 1.93308424937506 0.870963589956081 0.881048873008013
0.886149905570879 1.98316889105015 0.881048873008013 0.891250938133747
0.896411037869853 2.02719002775854 0.891250938133747 0.901571137605956
0.906790988480934 2.06696744343879 0.901571137605956 0.912010839355911
0.917291133255337 2.09849803338398 0.912010839355911 0.922571427154764
0.927912863975877 2.12357893711944 0.922571427154764 0.93325430079699
0.938657588541459 2.14005664051955 0.93325430079699 0.944060876285922
0.949526731153681 2.1487972001688 0.944060876285922 0.954992586021434
0.960521732505626 2.15246389580227 0.954992586021434 0.966050878989814
0.97164404997281 2.14700212750549 0.966050878989814 0.977237220955813
0.982895157806373 2.1313850148362 0.977237220955813 0.988553094656937
0.994276547328469 2.11134523843667 0.988553094656937 1
1.00578972712995 2.08287614852764 1 1.0115794542599
1.01743622327033 2.04509485699235 1.0115794542599 1.02329299228075
1.02921757948005 2.00405186059447 1.02329299228075 1.03514216667934
1.04113535736512 1.95495971643954 1.03514216667934 1.0471285480509
1.05319113661409 1.89924453256147 1.0471285480509 1.05925372517729
1.06538651520745 1.83960272848856 1.05925372517729 1.07151930523761
1.07772310962941 1.775289400868 1.07151930523761 1.0839269140212
1.09020255508219 1.7058959881623 1.0839269140212 1.09647819614319
1.10282650570279 1.63207900150234 1.09647819614319 1.1091748152624
1.11559663478218 1.55704752383933 1.1091748152624 1.12201845430196
1.12851463498714 1.47925002709272 1.12201845430196 1.13501081567232
1.1415822185846 1.39972186858949 1.13501081567232 1.14815362149688
1.15480111766861 1.31996875907094 1.14815362149688 1.16144861384034
1.16817308438994 1.24035490058089 1.16144861384034 1.17489755493953
1.18169989118827 1.15986741809103 1.17489755493953 1.18850222743702
1.19538333102722 1.08121966889926 1.18850222743702 1.20226443461741
1.20922521763189 1.00255374666816 1.20226443461741 1.21618600064637
1.22322738572938 0.927861869540424 1.21618600064637 1.23026877081238
1.23739169129188 0.854223287058328 1.23026877081238 1.24451461177138
1.25172001178278 0.784451432911519 1.24451461177138 1.25892541179417
1.26621424640541 0.715891722331649 1.25892541179417 1.27350308101666
1.2808763163549 0.65136152555391 1.27350308101666 1.28824955169313
1.29570816507272 0.589963911967636 1.28824955169313 1.3031667784523
1.31071175850435 0.532491075885741 1.3031667784523 1.31825673855641
1.32588908535987 0.478950863350784 1.31825673855641 1.33352143216332
1.34124215737749 0.428373206718199 1.33352143216332 1.34896288259165
1.35677300959029 0.38212811282464 1.34896288259165 1.36458313658892
1.3724837005959 0.3395087878183 1.36458313658892 1.38038426460289
1.38837631282941 0.300194748716336 1.38038426460289 1.39636836105594
1.40445295283935 0.264189310294684 1.39636836105594 1.41253754462275
1.42071575156693 0.231512405660647 1.41253754462275 1.4288939585111
1.43716686462852 0.201685529953453 1.4288939585111 1.44543977074593
1.45380847260132 0.175360313603707 1.44543977074593 1.46217717445672
1.47064278131246 0.151666085659789 1.46217717445672 1.47910838816821
1.48767202213132 0.130669144908905 1.47910838816821 1.49623565609443
1.50489845226532 0.11217793034544 1.49623565609443 1.51356124843621
1.52232435505912 0.0957964545655261 1.51356124843621 1.53108746168203
1.53995204029726 0.0815025153372252 1.53108746168203 1.54881661891248
1.55778384451032 0.068987791615109 1.54881661891248 1.56675107010815
1.57582213128463 0.0582481715196239 1.56675107010815 1.58489319246111
1.59406929157558 0.0488920374793037 1.58489319246111 1.60324539069004
1.61252774402449 0.0408225239070559 1.60324539069004 1.62181009735893
1.63119993527923 0.0340229514834548 1.62181009735893 1.64058977319954
1.65008834031855 0.0280761007351293 1.64058977319954 1.65958690743756
1.66919546278006 0.0231923995441608 1.65958690743756 1.67880401812256
1.68852383529215 0.0190438486694803 1.67880401812256 1.69824365246174
1.70807601980967 0.0155850749260878 1.69824365246174 1.71790838715759
1.72785460795348 0.0126267236969073 1.71790838715759 1.73780082874938
1.74786222135403 0.0102802505008845 1.73780082874938 1.75792361395869
1.76810151199881 0.00818752731196253 1.75792361395869 1.77827941003892
1.78857516258386 0.00661755680076707 1.77827941003892 1.79887091512879
1.80928588686939 0.00533139839639902 1.79887091512879 1.81970085860998
1.83023643003947 0.00422913592628329 1.81970085860998 1.84077200146896
1.85142956906591 0.003329089839424 1.84077200146896 1.86208713666287
1.87286811307633 0.00261824825922205 1.86208713666287 1.8836490894898
1.89455490372652 0.00205036585123658 1.8836490894898 1.90546071796325
1.91649281557709 0.00160267881139132 1.90546071796325 1.92752491319094
1.93868475647449 0.00124537428215166 1.92752491319094 1.94984459975805
1.96113366793645 0.000964166863246368 1.94984459975805 1.97242273611485
1.98384252554187 0.000729833549717702 1.97242273611485 1.99526231496888
2.00681433932522 0.000560547168678737 1.99526231496888 2.01836636368156
2.03005215417554 0.000424447109722958 2.01836636368156 2.04173794466953
2.05355905024003 0.000329687667877573 2.04173794466953 2.06538015581054
2.07733814333228 0.000251866643642074 2.06538015581054 2.08929613085404
2.10139258534534 0.000181871473296708 2.08929613085404 2.11348903983665
2.12572556466944 0.000132836288706618 2.11348903983665 2.13796208950223
2.15034030661463 0.000106418615484922 2.13796208950223 2.16271852372702
2.17524007383829 7.87732850644546e-05 2.16271852372702 2.18776162394955
2.2004281667776 5.40435905707383e-05 2.18776162394955 2.21309470960564
2.22590792408699 4.10797491238242e-05 2.21309470960564 2.23872113856834
2.2516827230807 2.7634107376321e-05 2.23872113856834 2.26464430759307
2.27775598018042 2.19096934703618e-05 2.26464430759307 2.29086765276777
2.30413115136813 1.55587633837523e-05 2.29086765276777 2.31739464996848
2.33081173264421 1.01634341577389e-05 2.31739464996848 2.34422881531992
2.35780126049079 7.56881103102829e-06 2.34422881531992 2.37137370566165
2.38510331234057 5.62818215261649e-06 2.37137370566165 2.39883291901949
2.41272150705095 3.9273578006554e-06 2.39883291901949 2.42661009508242
2.44065950538371 3.3647481466411e-06 2.42661009508242 2.45470891568503
2.4689210104903 2.30277613368704e-06 2.45470891568503 2.48313310529557
2.49750976840258 2.08671510048688e-06 2.48313310529557 2.51188643150957
2.52642956852944 1.4377290732071e-06 2.51188643150957 2.54097270554931
2.55568424415909 1.60665476693591e-06 2.54097270554931 2.57039578276886
2.58527767296707 8.55218830253814e-07 2.57039578276886 2.60015956316527
2.61521377753033 4.22714610628089e-07 2.60015956316527 2.63026799189538
2.6454965258471 3.58179288422675e-07 2.63026799189538 2.66072505979881
2.67612993186287 3.5407924401226e-07 2.66072505979881 2.69153480392692
2.70711805600241 4.08363821159129e-07 2.69153480392692 2.72270130807791
2.73846500570804 3.46019416416675e-07 2.72270130807791 2.75422870333817
2.77017493598397 1.14019521636697e-07 2.75422870333817 2.78612116862977
2.80225204994711 2.25428701930502e-07 2.78612116862977 2.81838293126446
2.83470059938418 1.11424120458958e-07 2.81838293126446 2.85101826750391
2.86752488531526 5.50743295495686e-08 2.85101826750391 2.88403150312661
2.90072925856389 0 2.88403150312661 2.91742701400117
2.93431812033378 5.38206847550218e-08 2.91742701400117 2.95120922666638
2.96829592279217 0 2.95120922666638 2.98538261891796
3.00266716965999 5.25955763999354e-08 2.98538261891796 3.01995172040202
3.03743641680877 0 3.01995172040202 3.05492111321551
3.07260827286455 1.02796709831282e-07 3.05492111321551 3.09029543251359
3.10818739981877 0 3.09029543251359 3.12607936712396
3.14417851364618 0 3.12607936712396 3.16227766016838
3.18058638492989 0 3.16227766016838 3.1988951096914
3.21741583949385 0 3.1988951096914 3.23593656929628
3.25467175904233 0 3.23593656929628 3.27340694878838
3.29235908180715 0 3.27340694878838 3.31131121482591
3.33048280320209 0 3.31131121482591 3.34965439157827
3.36904797648515 0 3.34965439157827 3.38844156139203
3.40805971342826 0 3.38844156139203 3.42767786546449
3.44752318499491 0 3.42767786546449 3.46736850452532
3.4874436220255 0 3.46736850452532 3.50751873952568
3.52782631593072 0 3.50751873952568 3.54813389233575
3.56867661939289 0 3.54813389233575 3.58921934645004
3.60999994707553 0 3.58921934645004 3.63078054770102
3.65180177634092 0 3.63078054770102 3.67282300498085
3.69408764797629 0 3.67282300498085 3.71535229097172
3.73686316692808 0 3.71535229097172 3.75837404288444
3.78013400304502 0 3.75837404288444 3.80189396320562
3.82390589182957 0 3.80189396320562 3.84591782045353
3.86818463519817 0 3.84591782045353 3.89045144994281
3.91297610225029 0 3.89045144994281 3.93550075455778
3.95828623004638 0 3.93550075455778 3.98107170553497
4.00412102439479 0 3.98107170553497 4.02717034325461
4.05048656064787 0 4.02717034325461 4.07380277804111
4.09738898450723 0 4.07380277804111 4.1209751909733
4.14483451283833 0 4.1209751909733 4.16869383470335
4.19282943449458 0 4.16869383470335 4.21696503428582
4.24138011115088 0 4.21696503428582 4.26579518801594
4.2904929781468 0 4.26579518801594 4.31519076827766
4.34017454533966 0 4.31519076827766 4.36515832240167
4.3904313979674 0 4.36515832240167 4.41570447353313
4.44127019752137 0 4.41570447353313 4.46683592150964
4.49269768262944 0 4.46683592150964 4.51855944374921
4.544720669949 0 4.51855944374921 4.57088189614876
4.59734605507067 0 4.57088189614876 4.62381021399261
4.65058081343228 0 4.62381021399261 4.67735141287198
4.70443200124339 0 4.67735141287198 4.73151258961481
4.75890675642058 0 4.73151258961481 4.78630092322639
4.8140122995337 0 4.78630092322639 4.84172367584101
4.86975593476274 0 4.84172367584101 4.89778819368445
4.92614505086618 0 4.89778819368445 4.9545019080479
4.98318712216031 0 4.9545019080479 5.01187233627273
5.04088970950988 0 5.01187233627273 5.06990708274703
5.09926046133035 0 5.06990708274703 5.12861383991366
5.15830711460164 0 5.12861383991366 5.18800038928963
5.21803749589367 0 5.18800038928963 5.24807460249774
5.27845952240381 0 5.24807460249774 5.30884444230987
5.33958120300621 0 5.30884444230987 5.37031796370252
5.40141063931344 0 5.37031796370252 5.43250331492432
5.46395602675029 0 5.43250331492432 5.49540873857624
5.52722565564015 0 5.49540873857624 5.55904257270403
5.59122791230378 0 5.55904257270403 5.62341325190351
5.65597128017096 0 5.62341325190351 5.68852930843842
5.721464340905 0 5.68852930843842 5.75439937337159
5.78771577554015 0 5.75439937337159 5.82103217770872
5.8547343656323 0 5.82103217770872 5.88843655355588
5.922528994423 0 5.88843655355588 5.95662143529012
5.99110864801685 0 5.95662143529012 6.02559586074358
6.06048241657265 0 6.02559586074358 6.09536897240169
6.13065949550826 0 6.09536897240169 6.16595001861481
6.20164918671951 0 6.16595001861481 6.2373483548242
6.27346089981306 0 6.2373483548242 6.30957344480192
6.34610415335372 0 6.30957344480192 6.38263486190548
6.41958857612602 0 6.38263486190548 6.45654229034654
6.49392390841065 0 6.45654229034654 6.53130552647473
6.56912000327533 0 6.53130552647473 6.60693448007597
6.64518682788105 0 6.60693448007597 6.68343917568613
6.72213446480298 0 6.68343917568613 6.76082975391981
6.79997311336706 0 6.76082975391981 6.83911647281431
6.87871309100183 0 6.83911647281431 6.91830970918936
6.95836483460606 0 6.91830970918936 6.99841996002273
7.03893890193206 0 6.99841996002273 7.07945784384139
7.12044597298519 0 7.07945784384139 7.161434102129
7.20289685143947 0 7.161434102129 7.2443596007499
7.28630246606948 0 7.2443596007499 7.32824533138902
7.3706738721991 0 7.32824533138902 7.41310241300917
7.45602225316688 0 7.41310241300917 7.49894209332456
7.54235892180819 0 7.49894209332456 7.58577575029184
7.62969532195503 0 7.58577575029184 7.67361489361818
7.71804302995255 0 7.67361489361818 7.76247116628691
7.8074137561938 0 7.76247116628691 7.8523563461007
7.89781934667178 0 7.8523563461007 7.94328234724283
7.98927178454949 0 7.94328234724283 8.03526122185618
8.08178319174859 0 8.03526122185618 8.128305161641
8.17536583055585 0 8.128305161641 8.22242649947069
8.27003210524871 0 8.22242649947069 8.31763771102672
8.36579456373932 0 8.31763771102672 8.41395141645194
8.46266589923786 0 8.41395141645194 8.51138038202374
8.56065895193489 0 8.51138038202374 8.60993752184603
8.65978671070342 0 8.60993752184603 8.7096358995608
8.76006231482049 0 8.7096358995608 8.81048873008013
8.8614990557088 0 8.81048873008013 8.91250938133746
8.96411037869851 0 8.91250938133746 9.01571137605958
9.06790988480933 0 9.01571137605958 9.1201083935591
9.17291133255335 0 9.1201083935591 9.22571427154764
9.27912863975879 0 9.22571427154764 9.33254300796991
9.38657588541457 0 9.33254300796991 9.44060876285925
9.49526731153682 0 9.44060876285925 9.54992586021435
9.60521732505626 0 9.54992586021435 9.66050878989813
9.71644049972813 0 9.66050878989813 9.77237220955814
9.82895157806376 0 9.77237220955814 9.88553094656938
9.94276547328469 0 9.88553094656938 10
10.0578972712995 0 10 10.115794542599
10.1743622327033 0 10.115794542599 10.2329299228075
10.2921757948005 0 10.2329299228075 10.3514216667934
10.4113535736512 0 10.3514216667934 10.471285480509
10.5319113661409 0 10.471285480509 10.5925372517729
10.6538651520745 0 10.5925372517729 10.7151930523761
10.7772310962941 0 10.7151930523761 10.839269140212
10.9020255508219 0 10.839269140212 10.9647819614319
11.0282650570279 0 10.9647819614319 11.091748152624
11.1559663478218 0 11.091748152624 11.2201845430196
11.2851463498714 0 11.2201845430196 11.3501081567232
11.415822185846 0 11.3501081567232 11.4815362149688
11.5480111766861 0 11.4815362149688 11.6144861384034
11.6817308438994 0 11.6144861384034 11.7489755493953
11.8169989118827 0 11.7489755493953 11.8850222743702
11.9538333102722 0 11.8850222743702 12.0226443461742
12.0922521763189 0 12.0226443461742 12.1618600064637
12.2322738572937 0 12.1618600064637 12.3026877081238
12.3739169129188 0 12.3026877081238 12.4451461177139
12.5172001178278 0 12.4451461177139 12.5892541179417
12.6621424640541 0 12.5892541179417 12.7350308101666
12.808763163549 0 12.7350308101666 12.8824955169313
12.9570816507272 0 12.8824955169313 13.031667784523
13.1071175850435 0 13.031667784523 13.1825673855641
13.2588908535987 0 13.1825673855641 13.3352143216332
13.4124215737749 0 13.3352143216332 13.4896288259165
13.5677300959029 0 13.4896288259165 13.6458313658892
13.7248370059591 0 13.6458313658892 13.8038426460289
13.8837631282941 0 13.8038426460289 13.9636836105594
14.0445295283935 0 13.9636836105594 14.1253754462276
14.2071575156693 0 14.1253754462276 14.288939585111
14.3716686462852 0 14.288939585111 14.4543977074593
14.5380847260132 0 14.4543977074593 14.6217717445672
14.7064278131246 0 14.6217717445672 14.7910838816821
14.8767202213132 0 14.7910838816821 14.9623565609443
15.0489845226532 0 14.9623565609443 15.1356124843621
15.2232435505912 0 15.1356124843621 15.3108746168203
15.3995204029726 0 15.3108746168203 15.4881661891248
15.5778384451032 0 15.4881661891248 15.6675107010815
15.7582213128463 0 15.6675107010815 15.8489319246111
15.9406929157558 0 15.8489319246111 16.0324539069004
16.1252774402449 0 16.0324539069004 16.2181009735893
16.3119993527923 0 16.2181009735893 16.4058977319954
16.5008834031855 0 16.4058977319954 16.5958690743756
16.6919546278006 0 16.5958690743756 16.7880401812256
16.8852383529215 0 16.7880401812256 16.9824365246175
17.0807601980967 0 16.9824365246175 17.1790838715759
17.2785460795348 0 17.1790838715759 17.3780082874938
17.4786222135403 0 17.3780082874938 17.5792361395869
17.6810151199881 0 17.5792361395869 17.7827941003892
17.8857516258386 0 17.7827941003892 17.9887091512879
18.0928588686939 0 17.9887091512879 18.1970085860998
18.3023643003947 0 18.1970085860998 18.4077200146896
18.5142956906591 0 18.4077200146896 18.6208713666287
18.7286811307633 0 18.6208713666287 18.836490894898
18.9455490372652 0 18.836490894898 19.0546071796325
19.1649281557709 0 19.0546071796325 19.2752491319094
19.3868475647449 0 19.2752491319094 19.4984459975805
19.6113366793645 0 19.4984459975805 19.7242273611485
19.8384252554187 0 19.7242273611485 19.9526231496888
20.0681433932522 0 19.9526231496888 20.1836636368157
20.3005215417555 0 20.1836636368157 20.4173794466953
20.5355905024003 0 20.4173794466953 20.6538015581053
20.7733814333229 0 20.6538015581053 20.8929613085404
21.0139258534534 0 20.8929613085404 21.1348903983665
21.2572556466944 0 21.1348903983665 21.3796208950223
21.5034030661463 0 21.3796208950223 21.6271852372702
21.7524007383829 0 21.6271852372702 21.8776162394955
22.004281667776 0 21.8776162394955 22.1309470960564
22.2590792408699 0 22.1309470960564 22.3872113856834
22.516827230807 0 22.3872113856834 22.6464430759306
22.7775598018042 0 22.6464430759306 22.9086765276777
23.0413115136812 0 22.9086765276777 23.1739464996848
23.308117326442 0 23.1739464996848 23.4422881531992
23.5780126049079 0 23.4422881531992 23.7137370566165
23.8510331234057 0 23.7137370566165 23.9883291901949
24.1272150705095 0 23.9883291901949 24.2661009508241
24.4065950538372 0 24.2661009508241 24.5470891568503
24.689210104903 0 24.5470891568503 24.8313310529557
24.9750976840258 0 24.8313310529557 25.1188643150958
25.2642956852944 0 25.1188643150958 25.4097270554931
25.5568424415908 0 25.4097270554931 25.7039578276886
25.8527767296707 0 25.7039578276886 26.0015956316527
26.1521377753033 0 26.0015956316527 26.3026799189538
26.454965258471 0 26.3026799189538 26.6072505979881
26.7612993186286 0 26.6072505979881 26.9153480392692
27.0711805600242 0 26.9153480392692 27.2270130807791
27.3846500570803 0 27.2270130807791 27.5422870333817
27.7017493598396 0 27.5422870333817 27.8612116862978
28.0225204994711 0 27.8612116862978 28.1838293126445
28.3470059938418 0 28.1838293126445 28.5101826750391
28.6752488531526 0 28.5101826750391 28.8403150312661
29.0072925856389 0 28.8403150312661 29.1742701400117
29.3431812033378 0 29.1742701400117 29.5120922666638
29.6829592279217 0 29.5120922666638 29.8538261891796
30.0266716965998 0 29.8538261891796 30.1995172040202
30.3743641680876 0 30.1995172040202 30.5492111321551
30.7260827286455 0 30.5492111321551 30.9029543251359
31.0818739981878 0 30.9029543251359 31.2607936712394
31.4417851364616 0 31.2607936712394 31.6227766016838
31.8058638492989 0 31.6227766016838 31.9889510969141
32.1741583949384 0 31.9889510969141 32.3593656929629
32.5467175904232 0 32.3593656929629 32.7340694878839
32.9235908180716 0 32.7340694878839 33.113112148259
33.3048280320209 0 33.113112148259 33.4965439157827
33.6904797648516 0 33.4965439157827 33.8844156139203
34.0805971342826 0 33.8844156139203 34.2767786546451
34.4752318499491 0 34.2767786546451 34.6736850452532
34.874436220255 0 34.6736850452532 35.0751873952568
35.2782631593072 0 35.0751873952568 35.4813389233576
35.6867661939291 0 35.4813389233576 35.8921934645005
36.0999994707554 0 35.8921934645005 36.3078054770102
36.5180177634093 0 36.3078054770102 36.7282300498086
36.9408764797628 0 36.7282300498086 37.1535229097172
37.3686316692807 0 37.1535229097172 37.5837404288444
37.8013400304503 0 37.5837404288444 38.0189396320561
38.2390589182956 0 38.0189396320561 38.4591782045354
38.6818463519817 0 38.4591782045354 38.904514499428
39.1297610225029 0 38.904514499428 39.3550075455778
39.5828623004637 0 39.3550075455778 39.8107170553498
40.0412102439477 0 39.8107170553498 40.2717034325459
40.5048656064787 0 40.2717034325459 40.7380277804114
40.9738898450722 0 40.7380277804114 41.209751909733
41.4483451283832 0 41.209751909733 41.6869383470335
41.9282943449458 0 41.6869383470335 42.1696503428583
42.4138011115088 0 42.1696503428583 42.6579518801592
42.904929781468 0 42.6579518801592 43.1519076827766
43.4017454533965 0 43.1519076827766 43.6515832240166
43.904313979674 0 43.6515832240166 44.1570447353314
44.4127019752138 0 44.1570447353314 44.6683592150963
44.9269768262943 0 44.6683592150963 45.1855944374921
45.4472066994899 0 45.1855944374921 45.7088189614875
45.9734605507068 0 45.7088189614875 46.238102139926
46.5058081343228 0 46.238102139926 46.7735141287198
47.044320012434 0 46.7735141287198 47.315125896148
47.5890675642059 0 47.315125896148 47.8630092322637
48.1401229953369 0 47.8630092322637 48.41723675841
48.6975593476273 0 48.41723675841 48.9778819368447
49.2614505086618 0 48.9778819368447 49.545019080479
49.8318712216032 0 49.545019080479 50.1187233627273
50.4088970950989 0 50.1187233627273 50.6990708274704
50.9926046133035 0 50.6990708274704 51.2861383991366
51.5830711460163 0 51.2861383991366 51.8800038928961
52.1803749589368 0 51.8800038928961 52.4807460249773
52.7845952240381 0 52.4807460249773 53.0884444230988
53.3958120300621 0 53.0884444230988 53.7031796370253
54.0141063931342 0 53.7031796370253 54.3250331492435
54.6395602675029 0 54.3250331492435 54.9540873857623
55.2722565564015 0 54.9540873857623 55.5904257270404
55.9122791230375 0 55.5904257270404 56.2341325190348
56.5597128017095 0 56.2341325190348 56.8852930843841
57.21464340905 0 56.8852930843841 57.5439937337157
57.8771577554016 0 57.5439937337157 58.2103217770873
58.5473436563231 0 58.2103217770873 58.8843655355588
59.2252899442301 0 58.8843655355588 59.5662143529009
59.9110864801685 0 59.5662143529009 60.2559586074358
60.6048241657263 0 60.2559586074358 60.9536897240168
61.3065949550827 0 60.9536897240168 61.6595001861481
62.0164918671952 0 61.6595001861481 62.3734835482419
62.7346089981305 0 62.3734835482419 63.0957344480193
63.4610415335371 0 63.0957344480193 63.8263486190551
64.1958857612601 0 63.8263486190551 64.5654229034653
64.9392390841064 0 64.5654229034653 65.3130552647472
65.6912000327536 0 65.3130552647472 66.0693448007596
66.4518682788105 0 66.0693448007596 66.8343917568616
67.22134464803 0 66.8343917568616 67.6082975391982
67.9997311336704 0 67.6082975391982 68.3911647281429
68.7871309100183 0 68.3911647281429 69.1830970918936
69.5836483460607 0 69.1830970918936 69.9841996002276
70.3893890193205 0 69.9841996002276 70.7945784384138
71.2044597298519 0 70.7945784384138 71.6143410212901
72.0289685143945 0 71.6143410212901 72.4435960074989
72.8630246606946 0 72.4435960074989 73.2824533138903
73.7067387219913 0 73.2824533138903 74.1310241300918
74.5602225316688 0 74.1310241300918 74.9894209332458
75.4235892180821 0 74.9894209332458 75.8577575029185
76.2969532195502 0 75.8577575029185 76.7361489361819
77.1804302995254 0 76.7361489361819 77.6247116628692
78.0741375619382 0 77.6247116628692 78.5235634610072
78.9781934667178 0 78.5235634610072 79.432823472428
79.8927178454951 0 79.432823472428 80.352612218562
80.8178319174858 0 80.352612218562 81.2830516164097
81.7536583055587 0 81.2830516164097 82.2242649947073
82.7003210524872 0 82.2242649947073 83.1763771102669
83.6579456373931 0 83.1763771102669 84.1395141645198
84.6266589923788 0 84.1395141645198 85.1138038202378
85.6065895193488 0 85.1138038202378 86.0993752184602
86.5978671070342 0 86.0993752184602 87.0963589956082
87.6006231482045 0 87.0963589956082 88.1048873008013
88.614990557088 0 88.1048873008013 89.1250938133745
89.6411037869851 0 89.1250938133745 90.1571137605958
90.6790988480934 0 90.1571137605958 91.201083935591
91.7291133255337 0 91.201083935591 92.2571427154763
92.7912863975877 0 92.2571427154763 93.325430079699
93.8657588541457 0 93.325430079699 94.4060876285924
94.952673115368 0 94.4060876285924 95.4992586021435
96.0521732505624 0 95.4992586021435 96.6050878989814
97.1644049972812 0 96.6050878989814 97.7237220955812
98.2895157806377 0 97.7237220955812 98.8553094656939
99.4276547328469 0 98.8553094656939 100
