

{
  "opponent": "tz1gjaF81ZRRvdzjobyfVNsAeSC6PScjfQwN",
  "start_tick": "0",
  "end_tick": "417",
  "dissection": [
    {
      "state": "srs136U2KJweAXf7Excw61Zeu5R5L7mi2TCb1WKkowQJ6UdHJ2VZWS",
      "tick": "0"
    },
    {
      "state": "srs139BjMyU9kA3AQxGfvYAmCf94M8mhpvY7LEwVUkksRx1E6ULL5X",
      "tick": "13"
    },
    {
      "state": "srs12Tctj36cysRih9qYtSd26nDGWAdmoWJWb4AmqGsJxdLX4heD71",
      "tick": "26"
    },
    {
      "state": "srs121iuj71beFFUouc8BWLaZuuWCCbFTHJeLeoM9XhUvLpJ4zutXe",
      "tick": "39"
    },
    {
      "state": "srs127G23wb1akfK8iofyQemT7aqQSd1v7YyVhD3SLS1f5njxwd4fw",
      "tick": "52"
    },
    {
      "state": "srs135yyMdm6uxmeDRDusUSPVRKCPVPtUYHr37uECtT6Vfowbjai9R",
      "tick": "65"
    },
    {
      "state": "srs13MWVTAW2b3zogN84GWEgGTuKUpRutuFokmCTyLNJJk1N4qqujD",
      "tick": "78"
    },
    {
      "state": "srs12P7pB4oK1w85qRQf2PUzYzkRkAYMjdTMRmMPpoKaVSnvqSiwCa",
      "tick": "91"
    },
    {
      "state": "srs131AcuyhGy52Q5fw45TUK3fqfoQwwTgCFaS5VMCW6GYUgHQY53s",
      "tick": "104"
    },
    {
      "state": "srs12s9TiZcz4QEUebcb3o4tDrP1qQAhbrf1skPJBxei1ftgLMR65L",
      "tick": "117"
    },
    {
      "state": "srs12knipciLHFBuVveKy6fZMhPkPnHqNkazXexkqUmgEwkUqsLHb2",
      "tick": "130"
    },
    {
      "state": "srs11cUD8Jbu7eBA3icQPqxioZqazVLCqbVJQdYL29fxg4qRusymTm",
      "tick": "143"
    },
    {
      "state": "srs12PinvyotXb5jDPHGFdEj4dsJii79YuYi7rfGvG13FK9cT52xqj",
      "tick": "156"
    },
    {
      "state": "srs12cMPd1pm38SU5YiRYmKH2BL15dB7rqH5XSKD4ju8y1mYZ4cJ29",
      "tick": "169"
    },
    {
      "state": "srs12oLjbL3M9GSUHJZRufKewTSNiCVgCM4JWKRBhuSZX6yYuG6YXa",
      "tick": "182"
    },
    {
      "state": "srs11an7u8DUehALudEmoPHkj2MyA4LBLuR9jGVVCrtwfsreVwhWnf",
      "tick": "195"
    },
    {
      "state": "srs12hNcGLxjRkPHNWqwNqD9rZt1QS6Zp3XBypxE9Rbyy2a9MKMUD5",
      "tick": "208"
    },
    {
      "state": "srs13Acgr5ruaBGg7V2Tyj7ZLxg4iHraHPSk4fD1vqzjt9CZKpGJAu",
      "tick": "221"
    },
    {
      "state": "srs11ztua57MnSh1f6YUKFXPACfSNSMTqwxi8uYYyRdQwSLSP6WtVX",
      "tick": "234"
    },
    {
      "state": "srs13KyPMEM2PHmT4sB43rvyyLrQkzq3MxsbJVugEf82DAifNPaQzy",
      "tick": "247"
    },
    {
      "state": "srs11iECtZi9Ao18y2CMJn5QRCCrtQzYqwt6NYNkNCJRW5P9mzScqM",
      "tick": "260"
    },
    {
      "state": "srs12V8EpjHwEZKNsmnjqNHrRb5oSaAbKpo1Bw1KmXuBZx5GWbvw5v",
      "tick": "273"
    },
    {
      "state": "srs12fFGU3Lioc5bSzWRhH5DgeFxPvVZ78uT9ai2DqygQBRxSLUgFa",
      "tick": "286"
    },
    {
      "state": "srs13DMiNmyga3fwQNd6A1BX4kFQnKzsNoroJaw8B27HCv8Wjtb2jb",
      "tick": "299"
    },
    {
      "state": "srs11sFsBmVPxPjv65TesQBisnqEBwQEeNgX9wsBZkq5jm2XrMnjxi",
      "tick": "312"
    },
    {
      "state": "srs11tokjgGSEcCogV73k64pHphppTJ3MLsa6FFjhaj5GmkRAG9Hhc",
      "tick": "325"
    },
    {
      "state": "srs12uziiNFTJJSsNr2Vx6FVh2b1nBnCWRwpXMyCRMphBSG9N5koTy",
      "tick": "338"
    },
    {
      "state": "srs11uz2SkEcBuUVc2LE4fNDynDt4k7rqkiGvcnLXbHrLLFbBo58JG",
      "tick": "351"
    },
    {
      "state": "srs11eCVQc9U4Cbikcz7HpwvtgD3gJDVwgdhisueiXWnt4jCuQEDwA",
      "tick": "364"
    },
    {
      "state": "srs127bLVXoqtcwrZjPFZBefU58TEksDDeeaYgHRF5MWVaV8itmFUN",
      "tick": "377"
    },
    {
      "state": "srs132dWtVWi7RKYiNPDseXgbKXPT4tXWMWZNbKU6yskUgZKAy8UHj",
      "tick": "390"
    },
    {
      "state": "srs126UZP2kcrQT2zc3zLixwKJA9orZPo3WxS5PN9YA1BPMEaW1gYW",
      "tick": "403"
    },
    {
      "state": "srs12tD877tBBjfXj21sqxzKSpWGq5kTSjTvimRpNDs3Pw2f4W2TEX",
      "tick": "417"
    }
  ]
}


{
  "opponent": "tz1gjaF81ZRRvdzjobyfVNsAeSC6PScjfQwN",
  "start_tick": "246",
  "end_tick": "247",
  "dissection": [
    {
      "state": "srs11jfyag2W9Bat4YFiVhtwamKJw21mitJb6NAxPtLUt4fnsSCE5g",
      "tick": "246"
    },
    {
      "state": "srs13KyPMEM2PHmT4sB43rvyyLrQkzq3MxsbJVugEf82DAifNPaQzy",
      "tick": "247"
    }
  ]
}
