

{
  "opponent": "tz1gjaF81ZRRvdzjobyfVNsAeSC6PScjfQwN",
  "start_tick": "0",
  "end_tick": "990000000000",
  "dissection": [
    {
      "tick": "0"
    },
    {
      "tick": "22000000000"
    },
    {
      "tick": "44000000000"
    },
    {
      "tick": "66000000000"
    },
    {
      "tick": "88000000000"
    },
    {
      "tick": "110000000000"
    },
    {
      "tick": "132000000000"
    },
    {
      "tick": "165000000000"
    },
    {
      "tick": "198000000000"
    },
    {
      "tick": "231000000000"
    },
    {
      "tick": "264000000000"
    },
    {
      "tick": "297000000000"
    },
    {
      "tick": "330000000000"
    },
    {
      "tick": "363000000000"
    },
    {
      "tick": "396000000000"
    },
    {
      "tick": "429000000000"
    },
    {
      "tick": "462000000000"
    },
    {
      "tick": "495000000000"
    },
    {
      "tick": "528000000000"
    },
    {
      "tick": "561000000000"
    },
    {
      "tick": "594000000000"
    },
    {
      "tick": "627000000000"
    },
    {
      "tick": "660000000000"
    },
    {
      "tick": "693000000000"
    },
    {
      "tick": "726000000000"
    },
    {
      "tick": "759000000000"
    },
    {
      "tick": "792000000000"
    },
    {
      "tick": "825000000000"
    },
    {
      "tick": "858000000000"
    },
    {
      "tick": "891000000000"
    },
    {
      "tick": "924000000000"
    },
    {
      "tick": "957000000000"
    },
    {
      "tick": "990000000000"
    }
  ]
}


{
  "opponent": "tz1gjaF81ZRRvdzjobyfVNsAeSC6PScjfQwN",
  "start_tick": "198000000000",
  "end_tick": "209000000000",
  "dissection": [
    {
      "tick": "198000000000"
    },
    {
      "tick": "198343750000"
    },
    {
      "tick": "198687500000"
    },
    {
      "tick": "199031250000"
    },
    {
      "tick": "199375000000"
    },
    {
      "tick": "199718750000"
    },
    {
      "tick": "200062500000"
    },
    {
      "tick": "200406250000"
    },
    {
      "tick": "200750000000"
    },
    {
      "tick": "201093750000"
    },
    {
      "tick": "201437500000"
    },
    {
      "tick": "201781250000"
    },
    {
      "tick": "202125000000"
    },
    {
      "tick": "202468750000"
    },
    {
      "tick": "202812500000"
    },
    {
      "tick": "203156250000"
    },
    {
      "tick": "203500000000"
    },
    {
      "tick": "203843750000"
    },
    {
      "tick": "204187500000"
    },
    {
      "tick": "204531250000"
    },
    {
      "tick": "204875000000"
    },
    {
      "tick": "205218750000"
    },
    {
      "tick": "205562500000"
    },
    {
      "tick": "205906250000"
    },
    {
      "tick": "206250000000"
    },
    {
      "tick": "206593750000"
    },
    {
      "tick": "206937500000"
    },
    {
      "tick": "207281250000"
    },
    {
      "tick": "207625000000"
    },
    {
      "tick": "207968750000"
    },
    {
      "tick": "208312500000"
    },
    {
      "tick": "208656250000"
    },
    {
      "tick": "209000000000"
    }
  ]
}


{
  "opponent": "tz1gjaF81ZRRvdzjobyfVNsAeSC6PScjfQwN",
  "start_tick": "198000000000",
  "end_tick": "198010742187",
  "dissection": [
    {
      "tick": "198000000000"
    },
    {
      "tick": "198000335693"
    },
    {
      "tick": "198000671386"
    },
    {
      "tick": "198001007079"
    },
    {
      "tick": "198001342772"
    },
    {
      "tick": "198001678465"
    },
    {
      "tick": "198002014158"
    },
    {
      "tick": "198002349851"
    },
    {
      "tick": "198002685544"
    },
    {
      "tick": "198003021237"
    },
    {
      "tick": "198003356930"
    },
    {
      "tick": "198003692623"
    },
    {
      "tick": "198004028316"
    },
    {
      "tick": "198004364009"
    },
    {
      "tick": "198004699702"
    },
    {
      "tick": "198005035395"
    },
    {
      "tick": "198005371088"
    },
    {
      "tick": "198005706781"
    },
    {
      "tick": "198006042474"
    },
    {
      "tick": "198006378167"
    },
    {
      "tick": "198006713860"
    },
    {
      "tick": "198007049553"
    },
    {
      "tick": "198007385246"
    },
    {
      "tick": "198007720939"
    },
    {
      "tick": "198008056632"
    },
    {
      "tick": "198008392325"
    },
    {
      "tick": "198008728018"
    },
    {
      "tick": "198009063711"
    },
    {
      "tick": "198009399404"
    },
    {
      "tick": "198009735097"
    },
    {
      "tick": "198010070790"
    },
    {
      "tick": "198010406483"
    },
    {
      "tick": "198010742187"
    }
  ]
}


{
  "opponent": "tz1gjaF81ZRRvdzjobyfVNsAeSC6PScjfQwN",
  "start_tick": "198000000000",
  "end_tick": "198000010490",
  "dissection": [
    {
      "tick": "198000000000"
    },
    {
      "tick": "198000000327"
    },
    {
      "tick": "198000000654"
    },
    {
      "tick": "198000000981"
    },
    {
      "tick": "198000001308"
    },
    {
      "tick": "198000001635"
    },
    {
      "tick": "198000001962"
    },
    {
      "tick": "198000002289"
    },
    {
      "tick": "198000002616"
    },
    {
      "tick": "198000002943"
    },
    {
      "tick": "198000003270"
    },
    {
      "tick": "198000003597"
    },
    {
      "tick": "198000003924"
    },
    {
      "tick": "198000004251"
    },
    {
      "tick": "198000004578"
    },
    {
      "tick": "198000004905"
    },
    {
      "tick": "198000005232"
    },
    {
      "tick": "198000005559"
    },
    {
      "tick": "198000005886"
    },
    {
      "tick": "198000006213"
    },
    {
      "tick": "198000006540"
    },
    {
      "tick": "198000006867"
    },
    {
      "tick": "198000007194"
    },
    {
      "tick": "198000007521"
    },
    {
      "tick": "198000007848"
    },
    {
      "tick": "198000008175"
    },
    {
      "tick": "198000008502"
    },
    {
      "tick": "198000008829"
    },
    {
      "tick": "198000009156"
    },
    {
      "tick": "198000009483"
    },
    {
      "tick": "198000009810"
    },
    {
      "tick": "198000010137"
    },
    {
      "tick": "198000010490"
    }
  ]
}


{
  "opponent": "tz1gjaF81ZRRvdzjobyfVNsAeSC6PScjfQwN",
  "start_tick": "198000000000",
  "end_tick": "198000000010",
  "dissection": [
    {
      "tick": "198000000000"
    },
    {
      "tick": "198000000001"
    },
    {
      "tick": "198000000002"
    },
    {
      "tick": "198000000003"
    },
    {
      "tick": "198000000004"
    },
    {
      "tick": "198000000005"
    },
    {
      "tick": "198000000006"
    },
    {
      "tick": "198000000007"
    },
    {
      "tick": "198000000008"
    },
    {
      "tick": "198000000009"
    },
    {
      "tick": "198000000010"
    }
  ]
}
