[
  {
    "variant": {
      "id": "9593bd16-24cd-42df-bbef-8ca8a8498adc",
      "external_id": "321882938",
      "external_product_id": "AO1D",
      "title": "1-Day Oasys von Acuvue",
      "unit": "pcs",
      "content": 90,
      "option": {
        "sphere": "-0.5",
        "cylinder": "-2.75",
        "axis": "110",
        "add": "",
        "dominance": "",
        "radius": "8.6",
        "diameter": "14.3"
      }
    },
    "quantity": 1,
    "total": {
      "label": "62.50 CHF",
      "value": 62.5,
      "currency": "CHF"
    }
  },
  {
    "variant": {
      "id": "9593bd16-24cd-42df-bbef-8ca8a8498adc",
      "external_id": "321882938",
      "external_product_id": "AO1D",
      "title": "1-Day Oasys von Acuvue",
      "unit": "pcs",
      "content": 90,
      "option": {
        "sphere": "-0.5",
        "cylinder": "-2.75",
        "axis": "110",
        "add": "",
        "dominance": "",
        "radius": "8.6",
        "diameter": "14.3"
      }
    },
    "quantity": 1,
    "total": {
      "label": "62.50 CHF",
      "value": 62.5,
      "currency": "CHF"
    }
  }
]
