<?xml version="1.0" encoding="utf-8"?>
<!-- Generator: Adobe Illustrator 16.0.0, SVG Export Plug-In . SVG Version: 6.00 Build 0)  -->
<!DOCTYPE svg PUBLIC "-//W3C//DTD SVG 1.1//EN" "http://www.w3.org/Graphics/SVG/1.1/DTD/svg11.dtd">
<svg version="1.1" xmlns="http://www.w3.org/2000/svg" xmlns:xlink="http://www.w3.org/1999/xlink" x="0px" y="0px" viewBox="0 0 32 32" enable-background="new 0 0 32 32" xml:space="preserve">
<g id="performance_x2C__speed_x2C__speedometer_x2C__response_time">
	<path fill="#fff" d="M21.069,26.892c-2.861,0-4.916-0.795-6.729-1.496c-2.688-1.04-4.811-1.86-8.557,0.283
		c-0.17,0.096-0.381,0.086-0.54-0.028c-0.159-0.114-0.236-0.311-0.198-0.503c0.357-1.801,1.027-3.084,2.047-3.923
		c0.214-0.176,0.529-0.145,0.704,0.069c0.175,0.213,0.145,0.528-0.069,0.704c-0.631,0.519-1.104,1.271-1.43,2.284
		c3.562-1.69,5.822-0.816,8.404,0.183c1.816,0.703,3.693,1.429,6.368,1.429c2.568,0,5.226-0.953,7.108-2.548
		c0.211-0.179,0.527-0.152,0.705,0.058c0.179,0.211,0.152,0.526-0.058,0.705C26.766,25.851,23.867,26.892,21.069,26.892z"/>
	<path fill="#fff" d="M10.872,20.992c-0.02,0-0.041-0.001-0.061-0.004c-6.576-0.804-8.458-3.505-9.794-8.534
		c-0.052-0.196,0.02-0.404,0.181-0.526c0.164-0.123,0.381-0.135,0.556-0.033c3.303,1.94,4.5,1.252,6.016,0.381
		c1.171-0.674,2.498-1.434,4.852-1.013c0.271,0.049,0.452,0.309,0.403,0.581s-0.306,0.451-0.581,0.403
		c-1.99-0.36-3.052,0.25-4.175,0.896c-1.426,0.819-2.896,1.664-5.962,0.182c1.243,4.024,3.044,5.987,8.627,6.671
		c0.274,0.033,0.469,0.283,0.436,0.557C11.337,20.806,11.121,20.992,10.872,20.992z"/>
	<path fill="#fff" d="M9.712,11.102c-0.103,0-0.208-0.032-0.297-0.098C7.948,9.919,7.161,8.408,7.199,6.75
		c0.004-0.174,0.099-0.334,0.25-0.421c0.15-0.088,0.337-0.09,0.489-0.007c2.226,1.211,3.242,0.831,5.086,0.143
		C14.681,5.847,16.952,5,21.069,5c2.801,0,5.701,1.042,7.76,2.789c0.21,0.179,0.236,0.494,0.058,0.705
		c-0.179,0.21-0.494,0.235-0.705,0.058C26.299,6.954,23.64,6,21.069,6c-3.938,0-6.021,0.777-7.696,1.401
		c-1.704,0.636-2.985,1.113-5.108,0.194C8.5,8.834,9.308,9.681,10.01,10.2c0.222,0.164,0.269,0.477,0.104,0.699
		C10.017,11.031,9.866,11.102,9.712,11.102z"/>
	<path fill="#fff" d="M30.339,7.676c-0.128,0-0.256-0.049-0.354-0.146c-1.528-1.528-3.437-2.615-5.518-3.145
		c-0.268-0.068-0.43-0.34-0.361-0.607c0.067-0.269,0.341-0.432,0.607-0.361c2.256,0.573,4.324,1.751,5.979,3.406
		c0.195,0.195,0.195,0.512,0,0.707C30.595,7.627,30.467,7.676,30.339,7.676z"/>
	<path fill="#fff" d="M24.621,28.621c-0.223,0-0.426-0.15-0.484-0.375c-0.069-0.268,0.092-0.54,0.36-0.609
		c2.07-0.532,3.968-1.616,5.488-3.136c0.195-0.195,0.512-0.195,0.707,0s0.195,0.512,0,0.707c-1.647,1.647-3.704,2.822-5.946,3.398
		C24.704,28.616,24.663,28.621,24.621,28.621z"/>
	<g>
		<path fill="#fff" d="M23,24.015c-4.411,0-8-3.589-8-8s3.589-8,8-8s8,3.589,8,8S27.411,24.015,23,24.015z M23,9.015
			c-3.86,0-7,3.14-7,7s3.14,7,7,7s7-3.14,7-7S26.86,9.015,23,9.015z"/>
	</g>
	<g>
		<g>
			<g>
				<path fill="#fff" d="M26.525,12.476c-0.196-0.196-0.502-0.206-0.697-0.011l-2.583,2.583c0.168,0.043,0.33,0.113,0.462,0.245
					s0.202,0.294,0.245,0.462l2.583-2.583C26.73,12.977,26.721,12.671,26.525,12.476z"/>
				<path fill="#fff" d="M23,17.5c-0.4,0-0.777-0.156-1.061-0.439S21.5,16.4,21.5,16s0.156-0.777,0.439-1.061
					c0.564-0.566,1.555-0.566,2.121,0c0.284,0.284,0.44,0.661,0.439,1.062c0,0.4-0.156,0.777-0.44,1.06
					C23.777,17.344,23.4,17.5,23,17.5z M23,15.5c-0.133,0-0.259,0.052-0.353,0.146C22.552,15.741,22.5,15.867,22.5,16
					s0.052,0.259,0.146,0.354c0.189,0.188,0.518,0.188,0.707,0C23.448,16.259,23.5,16.134,23.5,16c0-0.134-0.052-0.259-0.146-0.354
					C23.259,15.552,23.133,15.5,23,15.5z"/>
			</g>
		</g>
	</g>
	<g>
		<g>
			<g>
				<circle fill="#fff" cx="25.75" cy="11.237" r="0.5"/>
			</g>
		</g>
		<g>
			<g>
				<circle fill="#fff" cx="27.763" cy="13.25" r="0.5"/>
			</g>
			<g>
				<circle fill="#fff" cx="18.237" cy="18.75" r="0.5"/>
			</g>
		</g>
		<g>
			<g>
				<circle fill="#fff" cx="28.5" cy="16" r="0.5"/>
			</g>
			<g>
				<circle fill="#fff" cx="17.5" cy="16" r="0.5"/>
			</g>
		</g>
		<g>
			<g>
				<circle fill="#fff" cx="27.763" cy="18.75" r="0.5"/>
			</g>
			<g>
				<circle fill="#fff" cx="18.237" cy="13.25" r="0.5"/>
			</g>
		</g>
		<g>
			<g>
				<circle fill="#fff" cx="20.25" cy="11.237" r="0.5"/>
			</g>
		</g>
		<g>
			<g>
				<circle fill="#fff" cx="23" cy="10.5" r="0.5"/>
			</g>
		</g>
	</g>
	<g>
		<path fill="#fff" d="M25.5,20.515c0,0.275-0.225,0.5-0.5,0.5h-4c-0.275,0-0.5-0.225-0.5-0.5l0,0c0-0.275,0.225-0.5,0.5-0.5h4
			C25.275,20.015,25.5,20.239,25.5,20.515L25.5,20.515z"/>
	</g>
</g>
</svg>
