0.0001187122121361086
0.740320942546423
0.4329126883207396
-0.006266345572913862
-0.01894881096488624
-0.01389499631339033
-0.01242062116283652
-0.04104657302867832
-0.02574491061567993
0.007040802080862631
0.02989509517029703
-0.6088443158392243
0.02845854841597438
0.01548850725158725
0.01743718832186838
-0.02612677045186544
0.02875658142906953
-0.02956782514938569
0.02987461314742686
0.01164925823245998
-0.04491825947513287
0.04860083783541708
0.0006893525340225673
-0.3311878522821202
0.002236185866788427
-0.003333459961296998
0.04059326025856818
-0.005867488938902626
0.002806739257322469
0.00340443993632333
0.02480232117832421
0.001723131061092061
0.02397599392559664
0.02142370187510334
0.02880285019202224
-0.01429373624484948
0.008273876996949606
-0.02644542991533247
0.03505211335061988
-0.01254873811114746
-0.07558248983199425
-0.002309013596293764
-0.02584141685601963
-0.005165462402223184
-0.03363929756541111
-0.01684920363791798
0.005270684661937776
0.01770156609107102
-0.02529630764204454
-0.001386628169418303
0.8320468013840392
0.0214782534792345
-0.05164799247309579
-0.02239935322484817
0.02113409918827881
0.006380451892394738
-0.05661502040451452
-0.03231426097130951
0.002670555168803167
0.01336997759940495
0.03293428244196846
0.006390765163711481
0.003357756245317857
0.03914442890262502
-0.01897675974289493
0.01082963011782681
0.03439592676668872
0.006597154714348944
0.007017811745263651
-0.01748880666215892
-0.0001257065122147652
0.004644348408728963
-0.02753103299623209
-0.0274974108118995
-0.4108971947553823
0.8652431845488316
0.01688364664954634
0.001026890710141381
-0.0363788174711439
-0.00392557310536334
0.04326861807258158
-0.00484147936060296
0.005116034432458656
0.007093579196087074
-0.01197076869155726
-0.06349728278393042
0.003365932324010966
0.002319781711612572
0.03420017347065556
-0.003891637685619895
0.004872824231159051
0.007963246520993643
0.0129856140832549
0.03909719485526386
0.008552755181243574
0.04488307823473692
0.03446995460257077
0.04011610900437815
-0.005947419446078239
0.03917621361799228
0.02928206819595698
-0.005021268884792138
0.02103932902625289
0.3022716042819018
-0.009335821382044269
-0.01141416492473184
-0.007830576433213891
0.02728831825572694
0.002919473271772827
0.004485411525386287
0.03855081557111072
-0.02896780893896441
-0.001734642458075934
0.002259518917349303
-0.05480795839328596
0.04034339691616461
-0.01458156082606333
0.0009634978277424968
-0.008607127019656022
-0.005560663839837552
-0.03419695362701764
0.03132726813875061
0.05080298999388423
0.03593739602535588
0.004344343956226309
0.02950621094128255
-0.02099442998672893
0.01051492423067628
0.00156768351771505
-0.008518968240401575
-0.06006331490490761
0.02463155818291771
-0.2964041921779775
0.01780071218346268
-0.02583151140667107
0.00582862336809231
-0.04529621456574056
-0.03789873359757068
0.002405801304642126
-0.008335413543209517
0.01109253270974166
-0.009881483697809513
0.4990111683239616
-0.01356968191955441
-0.02812765811515494
-0.002200135524790123
-0.002936566850815353
0.02699019123640196
0.02308480357255267
0.01440422602447315
-0.06327280764875703
0.0109043588624478
0.02256642921164502
-0.03711432450476131
-0.002224263864277424
-0.03837009989658548
0.05181262145482048
-0.008075657568589153
-0.8967084204298673
-0.05242622503688434
-0.04058552788349288
-0.003184174397919166
-0.02550267513275216
0.02227792921289995
0.02043612679067884
0.01678393556713113
-0.03433396313842444
-0.01759358483686099
-0.05450228707876657
0.02669545859518567
-0.6275369842153043
-0.02826012542133947
0.0376501356604925
0.01230562258075466
-0.01596282920868494
0.0005766713470617766
0.006065956880182947
0.01026037771030277
-0.009924321337062662
-0.005249931518665058
-0.009603637966982317
0.007815235070375974
0.04514123780544947
0.0367631047202206
-0.02161992567555289
0.0133347163009413
0.005123786451304142
-0.05641470558669748
-0.01135482172524195
0.01068747047730762
-0.011864810995922
0.0673973329251748
0.04633147487064233
0.0002408359749026537
0.002755395307496372
0.0201313500056934
-0.0010683548913417
0.07550836665443449
0.02239320312552315
-0.02231000198826487
0.01416091177754583
0.01777404002006332
-0.02532032904807335
0.0170550291281026
-0.001210424274668116
-0.01699933039795879
-0.01099223998752334
-0.03363252765266991
0.007920815517281115
-0.01442764783612079
-0.3252047876014181
0.03234112663804498
-6.046391515022534e-05
0.0142884601743219
-0.05286331883416159
0.01155410719275254
-0.004218285027534186
-0.02057800642822826
-0.01705648121953619
0.04443506071537158
-0.02068061504907121
-0.0356662421873989
0.07098368455355659
-0.01922272570423488
0.04295338575836572
0.03409178384711107
-0.02586289861274644
-0.01832254870049776
0.01558320224416986
-0.004426807491792108
0.01424742990825714
0.04639178823459136
-0.02758840811334889
-0.02530765611098354
0.01939913700697759
0.004668761744949406
-0.006830628352127677
0.01706920535466409
0.001864450473494512
0.01811937161021265
0.01356926747741771
0.01929215015662277
0.01295162328425474
-0.01830192415021158
-0.008117575362281594
0.01166629553702837
-0.009165885021500094
0.01282205553140422
-0.02500629359522286
0.02356130161691938
0.01887718288317371
0.01878874962675559
0.02101270361022116
0.008125105420106101
-0.005612774910055057
-0.001441208817357809
-0.009632183860928003
-0.02945824992694824
-0.02155620883001431
0.02202371384091093
0.01879927220319139
0.04077614344203912
0.003001291450610303
-0.2156071422487077
0.01820452142711292
0.01493029909390469
0.03016206692498459
0.02245705983126276
-0.002448849679550058
-0.1070241277564873
0.02227387248576543
-0.04187230884549793
-0.007613054078578208
-0.004403372896546893
-0.006520778600517576
-0.02555853380810563
0.0238206439877903
-0.02393705417090208
-0.04103687944647973
-0.0101536506931489
0.03487144279528141
0.01511154180190918
0.01407331555255287
0.02531023680273651
-0.004670979300445932
0.0421526623454978
-0.007239276077913337
-0.04959834890142875
-0.03664684770806478
-0.01235760390401501
0.002088309459846544
0.01104348704126303
-0.01337067551282925
0.03619998663039621
0.01120545711426589
-0.02161627785079421
-0.003419604064799947
0.03644453669431441
-0.3435146648408761
-0.004406072034141588
-0.01575189450739853
-0.04441958421000279
-0.002669134170983831
-0.00677993398132487
0.01792783315358894
0.009034074845959306
0.008800901698731631
-0.01931623557900948
0.005705147901898321
0.05501311907107132
-0.01442803622524613
-0.004906741277904818
0.004568969691147514
-0.005942887683517493
-0.01081290488552484
0.01668897180865034
-0.04835857818031028
-0.01207216070239309
0.007155989918761687
-0.01371270105486322
0.03820862298975545
0.04139943851083494
0.01989368731140946
-0.02458780808708091
-0.1613954732326475
-0.03289852472663713
0.03812901798641337
-0.01517457128511848
0.00274710798034418
0.04126143572561002
0.03524213954683498
-0.04633037919766186
-0.02648376064295684
0.005682304067172792
0.01602080788747952
-0.00207320328677091
-0.05794432691780407
0.03944782107991256
0.01027777320160794
-0.00678856154247231
-0.04369538656178549
0.003801455141514002
0.00228922060241081
0.02842761482476332
-0.03630086870278057
0.02433151627153343
-0.02725869291952504
0.0320017439730805
0.03635451267352213
0.01470228527594263
-0.02424130963792277
0.001135611962926797
0.02752196660408303
0.01420901429061751
0.04532638819924767
0.6940821471587145
0.01178815718599934
0.03779764762939844
-0.01590598093731756
0.001557914083890246
-0.03161141542698331
0.01637378235472162
-0.004804190981518202
-0.0235594018465077
-0.01404830322193745
0.01772627400738837
0.04530906537519323
-0.01930558002424473
-0.02251213538607576
0.02206466519480547
0.006794041821348895
-0.006360821454117754
-0.0002200259393782946
-0.05817843240178671
0.04193046577867061
-0.02246972920112209
-0.03563300177562093
0.03665654594808293
0.02248321664903027
0.001505996947906083
0.01099119178201876
-0.01680443148480967
-0.9360176245666705
0.8355839624033842
0.01136742307074802
-0.01982386687921856
0.004809567658184946
0.001067618520298292
-0.01640789259019265
0.03228058610324554
-0.02894042458018688
0.003190804603874869
0.003970268519696297
-0.02133900485684604
0.0572045548491527
0.01898333366458503
-0.04604221082158803
-0.01624083540307106
0.04313603567519315
-0.0134529436816242
0.03941894323139681
0.0177292568400753
0.05674723173294165
-0.0108781810696867
0.04221756730612705
0.001418164432515212
-0.02400640745582332
-0.01679903746179806
0.02617935043836111
0.02051513904160748
0.02765314915040704
-0.02088944891370405
-0.03735439765123111
0.2170711111235046
-0.03267018968641935
-0.02156023702234603
-1.517559735018793
-0.03477871688906261
0.05455606250498241
0.02810603715165583
0.001456708331843226
0.02353535509874315
0.04437015582104652
0.04033423899698142
0.0272520204971254
0.02500671999965904
-0.003491536066478765
-0.02230104589305737
-0.01280003775317528
0.009368056819000903
-0.01554619317370149
0.04218035606013558
-0.01122334113702271
-0.02974171090832976
-0.01997275518027751
-0.01980448921795739
-0.003222297023535254
0.02199259080387431
0.009019879842610606
-0.006878496625113566
-0.01671802369435332
0.03687117710231883
0.02126697762704245
0.03572703699129506
-0.01127234241682029
0.03159035165066847
0.003495126096380539
0.03710979925735628
0.009572483953623029
-0.00518848551293959
0.01515038695218736
-0.01764702802310392
0.5114127663755506
-0.01263908160198137
-0.007513243933217317
-0.02295909329982638
-0.04846712674327969
-0.01122977281944339
0.001438802579146616
-0.01945816822737944
0.002522664232231009
0.01052786341947848
-0.02444653485043951
0.03819037603350978
-0.02281187091314023
0.0004608273259564977
0.0007050663362874716
0.02135808849096345
0.00744123460149011
-0.04293710105145195
0.05439578335736057
-0.01990265365898964
0.02055917855753391
-0.03873270404776535
-0.01232227233580802
0.03217907073414895
0.007115744098849788
-0.02006195969422572
0.04291186574082904
-0.007366541548154324
-0.03957523214651579
0.01573401373317008
-0.2659765759324753
-0.03837347339356104
-0.007930814818500208
-0.4504367860965183
0.03606798729439693
-0.01966693844061398
0.01306055193594744
0.008974005181158621
-0.02772114756142699
-0.006643945209426769
-0.03067363913922551
-0.01915836942849228
0.02795626060758417
-0.003522674435131822
-0.05442977781815372
0.006770099413813095
0.01050251850087376
-0.03080765061992011
-0.0350049482847359
0.002685326889257723
0.02401957657278647
-0.02064477305702164
0.01886498834313853
-0.04852347114650734
-0.0282946914987084
-0.02050381873426924
-0.005520212083775093
0.01016661753014032
0.003704621846008484
-0.02766760167151957
-0.0592315020050095
-0.04973491764685468
0.005069625934291277
0.02922204618345162
0.003914693068414418
-1.03814332173866
-0.02320611315738718
-0.01627673026715739
-0.02182264585012974
-0.00964116246312836
-0.0004971716088476262
0.009952059978892581
0.008241526244087706
0.7290129667952278
0.001824161849507844
-0.202210544334277
-0.02319815559859283
-0.01498560704230208
-0.03061736356843554
0.05244743573054125
0.02873351244518384
0.01405203017886309
-0.002282525691843262
0.03314509936825814
0.069771037463637
0.01000776456225054
0.0124149912938849
0.01453360642562204
0.01359233509570037
-0.01522487196924379
-0.03658972527855243
0.02249624390139927
0.02810236702976129
-0.02177157665469639
-0.0003770572435326233
0.01577849629014519
0.04393538041680324
-0.06477960133801683
-0.00723372101567164
0.01649197743964616
0.0108394139053132
0.02076072428079136
-0.0102061549125084
0.3854971396443729
0.04057503877077615
0.02603425597938065
0.04749262646310725
0.005599024684668079
-0.04066261628930228
0.008950597121493632
0.01095106348276735
-0.008062777372471639
-0.02246189504249909
-0.01647824395516362
-0.01287595447656141
0.009087384628439374
-0.01898129492853962
0.0368266382068434
0.03686013948024651
0.01459909981429615
-0.001305287531860002
-0.06188415129884745
0.002594924365703739
0.1887964118924798
0.0299888705054788
0.0303397342073697
-0.01091380249729623
-0.02291305392514925
-0.04141695232255889
-0.008022755411803197
0.006917986613730593
0.007434588926305132
0.02770269922881523
0.002087999253868236
-0.003998729002090184
-0.02006216879347636
-0.02730591673231561
-0.002526296652621022
0.01042239459982976
0.009088206135841919
0.0002252287540220849
0.03747707844174507
0.01261845328725772
0.009281596506097426
-0.008837598776151345
0.02586834138940635
-0.0678081606224777
-0.01044053179347789
-0.04225853694793676
0.008509335511424425
0.0150454049598018
0.02775738942957613
0.001911341740007842
-0.5344907371960801
0.005053404570308619
-0.01163091231839621
0.0284573890610692
0.002886301158078714
-0.03343653707915642
0.0319339756697791
-0.02445165575876675
-0.01870605348894968
0.04040092752570464
-0.0002624956507784319
-0.0379612991577781
-0.01486996806431364
-0.01490193806762872
0.003939984667483783
-0.01652793101962763
-0.03348931537060756
-0.0002835765561187653
-0.02994171104178912
-0.03353344447591435
-0.01881402111778091
-0.005117871574483756
-0.02683962875762125
0.04633468119973694
-0.01648282827242356
-0.01300865520918768
0.04977433231620787
0.382748790291908
-0.03416293719065108
0.01509786386465464
0.0219675743355477
0.0004681939412880885
0.02105524463427224
0.01248427348051102
-0.004652135454261824
-0.2828144935888102
-0.01873182055148272
-0.008904388338116654
0.001577060356885083
-0.02724490603372794
0.007662364736683702
-0.03632632567734086
-0.02710301250797405
-0.0213019667168697
0.0190169262790653
0.4916922479532154
0.001281410843105168
-0.03100476388708816
-0.01065276217943063
-0.01268275584557955
0.0293981810124523
0.00837172826984886
-0.02619663944878586
0.01575957226046849
0.0004508061463925836
0.01300998268882713
-0.01389565866958615
-0.01451972517835804
-0.01006641228207681
-0.08206795705226805
0.003544699324460336
-0.01339931037050036
-0.003348046780925136
0.00981026093135013
0.03815988056799848
0.02232342764871664
0.004805178929847645
-0.04000847201166358
-0.004063089634921477
0.03863160787653051
-0.02513717752991566
-0.03017716302161635
0.006607172409209815
-0.01673604680936492
0.0475528633849699
0.007721150173530247
-0.01517755651880589
0.5003837181118396
0.03870465621394264
0.001398080841907459
-0.002474883470336409
0.00531087970036075
-0.0001928905716264641
0.008758222045450181
-0.002243929241726483
0.01394772022746448
0.04541098807498364
0.01610844991409213
0.06102398695900972
-0.04109946585389144
-0.005303861739818266
0.01040057389901122
0.02007164599807595
-0.002957227289649498
-0.0159511402872538
-0.0161868249614377
-0.02496797204554423
0.006606558248569725
-0.04947520330439718
0.01254744015513643
0.01070712195892292
0.01117110584353533
0.02989494285340027
0.2334368202848984
-0.01262339033685287
-0.0230453527039024
-0.04961980671361382
0.04588819641890136
-0.04897497192737146
-0.01861736438000832
0.01247209347206235
-0.01947292395415055
0.009137043362287663
0.002759966928296834
-0.3118012108595643
0.005059461464616911
-0.034734924528565
0.000966425305320509
0.004645472029205715
-0.03510563173363733
-0.09571204439034943
0.04407600732451385
-0.02999297697814809
-0.01895510660111092
-0.03786384749817318
0.01219405879035628
0.03280131621865915
-0.05110168369657916
0.01883459115438069
0.0163354646875891
-0.02434300160916975
0.02166695910422681
-0.02679490602795881
-0.01446922128320149
0.02073638210347468
0.02895935543788387
9.071023048279031e-05
0.002087121321489115
0.00908889113406601
-0.06401484267177503
0.007394832475664414
0.0001312565915159067
0.00129397119865994
-0.03654523116822533
0.01570411616801985
0.02390298504004535
0.01138243961347954
-0.01012377927102871
0.02059699738109707
-0.0144386128115234
0.02604125136372071
0.009530492412149457
-0.03101316515464545
0.02061014807823981
0.02621645319588166
0.01807053941198798
-0.01358719040019826
-0.03336922572491006
0.008175357859162678
-0.0117311091926314
0.05700525457031093
-0.03608580318151312
0.01045015850268748
0.0175385249890831
-0.002102161686854252
0.02434866986974386
0.02745000647985302
-0.03505294088168635
0.008165574966048562
-0.03852466275565654
0.02076557461480363
-0.02431966315992642
-0.02910223855056257
-0.04009222383910593
0.05179541549490464
-0.03498679741302085
-0.002655138722317108
0.005413198346558406
-0.01109017838712613
0.0120365523861471
-0.06701623373155999
0.004236185159206434
-0.01772626359720622
-0.01784247231084747
0.02408019259446539
-0.02394458169770185
0.02313717051740896
-0.01539789303149217
-0.02253118933657636
-0.00521160037586562
-0.0177686233198079
0.02768344943597209
-0.0208503004719116
0.005246707598121789
-0.009249184426519945
-0.001991874937024793
0.01357867420210313
-0.0348567845103083
0.01574898549487267
0.01162177480101955
0.02847687849312427
-0.003886532151529376
0.01554849742660122
0.0177711303161573
-0.02333439435001746
0.01343847872936079
-0.005341356693951264
0.001720524603970534
-0.0058079072719237
-0.5443644217248144
0.00968797024385688
-0.04133914112713079
0.01076893888697092
0.005171687674193664
-0.02800521683004335
-0.04682374260588018
0.0479867249838048
-0.05174468892345194
0.01647851715017576
-0.0364333924223432
-0.0269324048700745
0.02239690751259378
0.005843713298879694
0.1634874339261957
-0.04141740781120499
-0.03109188780534692
-0.02263871287080049
0.008716393971151726
0.02094246014947044
0.02778377062836634
0.02298270215907799
0.03405801118407133
-0.008058010717187399
0.02778884582947592
0.04362397841181126
0.03007807485354922
0.00477491356056744
-0.7027147155640668
-0.01688691948996761
-0.02103463062931722
-0.0006788206297649585
0.02158669067358872
-0.0004763170795831786
0.01485411161542044
0.008846475859590301
0.009625398886347149
-0.02970679128241713
0.0865417315641821
0.3031117587463315
-0.4359245847612134
-0.003230083879409807
0.02600852707874924
-0.005009314623913547
0.002599930732887127
0.006002146282113875
-0.007403520816764092
0.02094663318834882
-0.03128964196214979
-0.002966875102657255
0.05140798266072866
-0.007429046047256081
0.03442603969404004
0.02877624235237739
0.002495862828424257
-0.01471383061985316
-0.0009100195284384495
-0.01479797698626869
-0.02565200345319161
-0.01659977730012984
0.03898469093120048
0.006684610542538004
-0.03028638989903474
-0.0223354729781147
-0.01421271644055153
-0.01231927628941742
-0.03025553239340522
-0.05301951998130903
0.01617836476248095
0.3007885854959129
-0.005235772985415648
0.02239528763161861
-0.003653914433920314
0.245855139520356
-0.01577167798023147
-0.009417501484547723
-0.01041073710762236
-0.05685210567974036
-0.005849790577192233
-0.007579331066070581
0.5137403005592827
0.007402855022327921
-0.02841280297835892
0.009995042091437109
0.02660301068207903
-0.009280645112719249
-0.03200163024570051
-0.01086002661828709
-0.02805499955693142
0.02393896793611744
-0.004608259493842462
-0.02446673843605936
-0.02331845915469596
0.04265787443942727
0.001706381494232151
0.00113132010677203
-0.02585362117454754
-0.01395516770691091
-0.03042169972260353
-0.03467097276442255
-0.00698568813901898
-0.008921830678547392
0.03721652881645631
0.02737502830261477
0.03458190483438184
-0.002389757055439153
0.0008255819161811431
0.004229198019508778
0.05138670826852162
-0.01899732666774727
0.02993819519508237
0.008589736484770906
0.02762524005224487
-0.007597003605914626
-0.007797733832639126
0.01453743197333683
-0.0447309071830744
0.002969353711366615
0.002678762105469197
0.01546460512766742
-0.05363766294364184
0.01577911283869225
0.00499231482317926
0.009823694084589205
0.02421676993861438
0.02433368861299476
0.03164107656931078
0.02279442907793251
0.009689864405964237
-0.008159462997532724
0.001331192648394461
0.013628248046938
0.02071134800481125
-0.005543766937933236
-0.009172864680034039
-0.03846764487036464
0.03478037636997663
0.05153800020828136
0.01397052392862226
0.0004814523661056576
-0.0001174351709752004
0.006260841052437144
0.01136522152216444
0.01432523589015767
0.02696184913867324
0.003825139924419233
-0.005567439801543499
-0.01329478890268165
0.03123252458021743
-0.01596879184353512
0.01017698616719287
-0.0309328564909604
-0.003460535914507967
-0.006521218304961863
0.01700565200197174
0.0008923614451051328
-0.0004071429213518965
-0.001750607184711847
0.02351232729579366
-0.01740909543317604
-0.02098026789175756
-0.02364401039817358
0.01175042685429913
-0.03582352882392095
0.06737041686641615
0.01066616638989086
0.01391200043174273
-0.02602746124050893
0.0224835857059735
-0.00291894535842169
0.556933687300155
0.01048542229986608
-0.01026722727654672
0.003958812123729663
-0.5534911625038132
0.003469208176422297
0.01562412377610349
0.001439108814710956
0.002500232706715421
-0.03676613818850569
-0.06207890731769872
0.03981561227297552
-0.04985656380703395
0.0345333132671615
0.01573918525993616
-0.04162429190241252
0.02373515291550095
