-0.2697034187735824
1.149402500898531
0.6711971428928213
-0.002913796815719585
-0.03298440843177717
-0.03359526674746642
2.162116806694762e-05
-0.0466643116378847
-0.03703459686978819
0.02273047153657629
0.05474604788992891
-0.9561468158318137
0.03304633897505344
0.02526787846231176
0.01559990767491719
-0.05533726412915693
0.04938275587393388
-0.0486694669934101
0.05580416691799284
0.01328051354299814
-0.0598983816528254
0.08233851032418513
-0.002924166071899677
-0.4988721576213673
0.004768524480542547
-0.003315980719407431
0.07170048185103858
-0.03368352059240314
0.02081967132701375
0.009788383675935295
0.03114441824315007
-0.008282731651203504
0.0291673372514408
0.02741683492809606
0.04976358259245903
-0.02066309675220078
0.02455619264750084
-0.02823947815958471
0.06264907189550667
-0.01367328463525357
-0.09751092817797335
0.0107001750692444
-0.04752861124123819
0.01259487145920147
-0.03791080474504999
-0.0279524639919002
0.004111036339008562
0.03608534011303108
-0.04061022496799608
0.009252776222979696
1.26537030020222
0.02799041026781168
-0.07612123878662713
-0.02740726311972939
0.04249514357859316
0.03898348755365721
-0.04649839829398322
-0.02880960819538561
0.01608977833212864
0.02543522043711865
0.05886876423471078
0.02440941141093099
-0.004260804603032683
0.05703201224357402
-0.0313969454150623
0.01078695127014041
0.04863996788472867
-0.002165247678586216
0.01868416799093477
-0.01998103678931255
-0.0003163640162298011
0.006498123523896175
-0.03747018284856728
-0.03041916471372847
-0.6345880538030417
1.348612468085463
0.01634142043781883
0.001398285261296476
-0.06504100301244436
0.008299817123590092
0.04138732904339615
-0.03094568144454899
0.01065256255660031
0.04530979315219885
-0.01648741989309727
-0.09575577990397183
-0.01463444062734788
-0.01818217215106364
0.05446783043264405
0.001438358606841401
0.01568359115692539
0.01574760235965116
0.007203431841240691
0.09336824603585915
0.02267092126756869
0.06595069588648302
0.06237009359707073
0.05033662605941813
0.001322304884130299
0.08029445261845672
0.05234999992062053
-0.01919562553477903
0.03697468763335943
0.4569549981478074
-0.02039715288541716
-0.01196044924939883
-0.03196862462918405
0.02793043954421079
-0.009489353080715156
0.006301572735249495
0.0626290978064909
-0.04573596295303873
-0.01071083881349992
0.0139043457182538
-0.06336186554127239
0.05865357827213769
-0.003700659854087462
-0.001083429064767031
-0.02172500507666864
0.0004685850112961885
-0.03624944463707922
0.02877257274473574
0.07899377482928227
0.06218466384037048
-0.007422841094935509
0.02082687449503283
-0.03151267615017114
0.02270862144287934
-0.002492228739313113
-0.01059756830810018
-0.0909138025594888
0.03742542350635697
-0.4553829309781944
0.02854201368104013
-0.02577562145306585
0.003393192311676303
-0.06834313671607498
-0.05612381082211496
0.007640082316904514
-0.008617585533142482
0.01683127358998839
-0.005798450136611498
0.7795175956573335
-0.01015742625067115
-0.02919874183408146
0.0007941326928520338
-0.006547976770790029
0.04363006035020976
0.03078844658302956
0.02919844660730908
-0.1100354540617992
-0.001100638844970959
0.02627591090316385
-0.0652412727836587
0.01676728173935061
-0.05064814002540492
0.07392795659935263
-0.01416214066428631
-1.380274291708994
-0.02460555675013379
-0.06960062326597435
0.003666952103946447
-0.03457619179662273
0.03768393096300868
0.03786159469458348
0.02172747561120923
-0.0475723948862303
-0.04280210485311183
-0.07615891824636165
0.03803654561119299
-0.98468057562878
-0.04534524102927155
0.06514098303082186
0.03182783875324489
-0.02212781223913131
0.01045157043037357
0.01790974077459066
0.01375027056881383
-0.02066569893626852
-0.01329590109214869
-0.010539015545327
0.008333856530027771
0.07622253188799716
0.0398856148097777
-0.02216838399676689
0.01326322104097662
-0.005208012485043319
-0.07570382514666146
-0.01245902797324535
0.0261001052487899
-0.003140093913168416
0.08798902282838809
0.05780215786119702
-0.0124053693908012
-0.01076066854536743
0.01958228132797451
-0.009822875172108685
0.0815677778585947
0.02950052469859931
-0.01796795269043746
0.004626367902997472
0.03233085561135696
-0.03236171309912316
0.02043041161952661
-0.00236843304089214
-0.03338941326167866
-0.01590678769672722
-0.04382760589456037
0.001453807635114104
-0.02273203654445536
-0.5006166755652648
0.02752555692700668
-0.00180769222825406
0.004393893108221971
-0.07514620898611379
0.0315172255527184
0.02480968932968034
-0.03643516426961876
-0.03352470425764253
0.06893098545950715
-0.03865605803406383
-0.06936132208432022
0.08570679061520005
-0.0277199441781328
0.05898711196288729
0.03317743863882573
-0.01865885603024781
-0.02103150787114354
0.03108479956818778
-0.01989835930318108
0.01226951657983559
0.05767043778062054
-0.05488128487459576
-0.03936860790565417
0.06463829968370438
0.02554292535464722
-0.009879498920918909
0.04498787979032499
0.002433991030030956
0.02540070720919453
0.03044903971522091
0.02828040886073076
0.008389135587380856
-0.02996818439619184
0.006750254833072592
0.01073664732173462
-0.01329501298324517
0.02071308469690029
-0.04148037514674115
0.06025083925132378
0.01705682881343896
0.02650351530967888
0.0376737951681014
0.03605678373370087
-0.009187766366154678
-0.0140732998168195
0.0004033795676008939
-0.04299211785835107
-0.03575337707358956
0.04280239693113738
-0.01269192315645948
0.08595049002046373
0.02496806681586079
-0.3178850570581991
0.01751931056509037
0.02744477814285141
0.05836236846650634
0.03682168095795641
-0.02343776586626097
-0.1579866664894418
0.05605293741820624
-0.06174162824310817
-0.01542902575760951
2.862041256801086e-05
0.004317503194665302
-0.05637679354473103
0.04320176991235772
-0.03230456454925197
-0.05775288536621808
-0.009250628789031979
0.05612032044096869
0.008144272654801755
0.01354921911937215
0.03799946586303254
-0.01657383130121302
0.05637089566487996
-0.02505817440227276
-0.04025830401897502
-0.03288500989866468
-0.003116672131794275
-0.009250122324897116
0.03102811936588518
-0.003302210796828212
0.06159233093578245
0.01705211966382843
-0.05990450503668956
-0.0002380523541745394
0.07138081027346471
-0.5295187612332624
-0.007501461305204365
-0.01235427308056103
-0.06235722372958507
0.01312173017062348
-0.01379714465937479
0.01350410928424854
0.006331568872292783
-8.802985595765009e-05
-0.01718651021893701
0.00395005036526148
0.1053094896390361
-0.0115159418551039
-0.01654975346874787
-0.005284698804658194
-0.01830869692208224
-0.02085779149052448
0.02784007704897004
-0.07219660915173486
-0.003763166971304559
0.005275521481858895
-0.02037833776222546
0.05155152023521648
0.05995164953200344
0.0218860084366247
-0.02245408563012653
-0.2516806288418729
-0.0603275854539841
0.05286101805482101
-0.04174856127762731
0.009461563533198296
0.0394873708163843
0.05094205432718884
-0.07642631974505879
-0.03941345452715377
0.02283650986598151
0.03812755890415108
0.003610153109783394
-0.08281602679513861
0.07043714138389739
0.01321235343644744
-0.00477938469568322
-0.07719363934283877
0.006034392539637779
0.003288191879846758
0.02732535120037583
-0.04354584207842128
0.05423404568730932
-0.04617618533180043
0.03224695335046701
0.07024452976956068
0.01503139124554664
-0.04682450600120713
-0.00520085574599031
0.0406318661511504
0.05390280090761441
0.04914070021782115
1.082950059168207
0.0194421867750426
0.04921146867474514
-0.01489378276381339
0.006314941819284512
-0.03902208413946499
0.03919035341885221
-0.007992544085715137
-0.02818236160797859
-0.008223824118716886
0.03988293788069251
0.0896398153826681
-0.03796825776985342
-0.04001589793211049
0.01530539672187479
0.007856319190936992
-0.01651969449957019
0.001232486361768542
-0.07609065538625095
0.06641285476040647
-0.03384469108374758
-0.05750878751911498
0.06402227720423766
0.05397263845719672
-0.007772725736623944
0.01287342850459451
-0.03031539065324682
-1.439165302244508
1.279762034166523
0.01945053586582063
-0.01731818035981245
-0.0146370442264305
0.02155738532045176
-0.02786254422496522
0.04787024263992871
-0.009765611695273431
0.01164242704197456
0.005744766820541896
-0.0437330994567869
0.08553589706152737
0.0382973678174311
-0.07223537230407542
-0.03509070902313231
0.04942699125130554
-0.02111486521885367
0.04774664855778469
0.01694689960393695
0.07914831044820106
-0.03822018218382636
0.05464134351817938
-0.005963570404326093
-0.02685281464946623
-0.0300084940123687
0.02785038860660943
0.04198777321395908
0.0508332267063818
-0.03746198150688707
-0.05021490191711456
0.3417317194821442
-0.05885342482739905
-0.03182101121151153
-2.310990634762578
-0.04494748664679464
0.05662378068992951
0.02136020501723853
0.0268205552988815
0.03908456832054451
0.05270426431941373
0.04144481092204662
0.03604084148268046
0.01821970302476643
-0.00296853140092877
-0.03778888784823212
-0.01843711716380625
0.02387185443753677
-0.02632577403751124
0.06870011825682124
-0.00838008938980451
-0.05334211001052654
-0.03433527725984648
-0.007378559152990159
0.009134984655079075
0.02481248496553334
-0.000657378317688266
0.004891941341564164
-0.02454364835198767
0.066411594429876
0.02356788529867473
0.05140041679523671
-0.007477676625002945
0.03676655965136225
-0.003058601749824932
0.05664665862108162
-0.007565126009234767
0.004339223631675685
0.02220808188540825
-0.01723268208295762
0.7901351681924708
-0.03450625398637498
-0.01902560145722922
-0.03494889842288171
-0.07170338314336586
-0.00615763134639355
0.003889173015767969
-0.02637676983465159
0.01905439480679343
0.01376980007730283
-0.04267774211198242
0.06830941227759195
-0.01688659790333096
-0.007821744126113646
-0.03119133578435731
0.03971110392789801
0.003138164554871254
-0.0688389471743155
0.08553737915783652
-0.05560027283937862
0.01156914313827443
-0.043658604049683
-0.02300167080858143
0.03684557338615844
0.02139041497876177
-0.01382443934388546
0.04756258514096372
0.001875938716409439
-0.06721144772999532
0.03457055885171666
-0.4130351818185286
-0.04951105986771053
-0.01781944574286298
-0.6879628068913642
0.05027780065959059
-0.03275745179322684
0.02394239792966612
0.02066623299305265
-0.03740732784568701
-0.0152683366665826
-0.0454772633132982
-0.03539308604342575
0.05860969682148747
0.01379248912275492
-0.09039425662242896
0.01815807651340765
-0.001762186502638595
-0.046137708925639
-0.04813205298212618
0.01966945367975006
0.04888227433640039
-0.03238368735714794
0.02434183369239857
-0.06716860672756196
-0.04132512935136632
-0.03276730187609502
0.0008529162969956496
-0.01039678577868264
0.009683692826768448
-0.03183995229303484
-0.08591833780334597
-0.05982149839872666
-0.01527568053807702
0.04417152942196734
0.01620034538208884
-1.575350919388512
-0.01362053934731936
-0.01157630556830494
-0.05395823840253026
0.003876325763506934
-0.001319880252464041
0.01369928610672865
-0.003664537163293288
1.114619243436201
0.00379232471725822
-0.314886931876162
-0.03169319792835412
-0.005751351536357165
-0.05740165827163882
0.08714058818216154
0.05241816503500676
0.02722042631604459
-0.005795366148239129
0.05337322931238925
0.08278274171282096
0.02043155105866966
0.02314062231435449
0.002671146308101471
0.02848635848536139
-0.0132038207020415
-0.07311460302622787
0.02475891719299061
0.06530544100815718
-0.01427498771848159
0.0006232208503712498
0.02010585870977304
0.07691534589290867
-0.08916086087048987
-0.005947945164021622
0.02572952480114711
0.01756201172664328
0.03341808150502873
-0.02545322930447343
0.58493068416709
0.07723372336495699
0.04099972347790937
0.06517493226849028
0.01550621495298509
-0.07356273963205377
0.01037184448671366
0.01432567977359032
-0.01893391201835704
-0.04136623510921065
-0.03620552107580246
-0.01788575185366562
0.02091213196109685
-0.008298159051721798
0.03121136899250691
0.04019722101078334
0.03958217882565263
-0.000367332260813265
-0.08890884298022741
0.02112667048799832
0.2926005412793817
0.06762101356838163
0.06482664034133631
-0.01979942955062563
-0.03484165114788721
-0.05353412682332407
-0.01149969243143459
0.01109522199566127
0.01155387647619192
0.02599977122798845
0.008064725324279324
0.002554570503883519
-0.01516777742516783
-0.02014528292097489
-0.00378376838827507
0.02058904550798109
0.008435902519332003
-0.003897562257862299
0.05114642980242722
0.01260274452237546
0.007811958433440393
-0.03013131090242103
0.04978026669808697
-0.09088188358238204
-0.001309245170114302
-0.0563991195505819
0.01727538400947994
0.04245349974957723
0.0442641693540225
0.009851913983002775
-0.8374678468550698
0.003075901091237991
-0.02346469630415528
0.03895285952131929
-0.001871205403017576
-0.06917459434132792
0.03687213867844705
-0.05751735590803063
-0.005682004020616689
0.09076449767098459
-0.004535650940876399
-0.04327677439851649
-0.01080768257129915
-0.01626630865777762
0.004324711565303282
-0.03263693430750221
-0.05914858686770958
-0.01437779385933717
-0.05515785599518519
-0.0543829623870672
-0.02609097981736307
-0.01378351464475686
-0.03434590281795458
0.06389205502851684
-0.01337157948543257
-0.0271554214769842
0.07920386645595844
0.5819250930096254
-0.05684545764719162
0.01990142770604587
0.03110294297535482
0.02769147781348398
0.03524138057220597
0.008457070997941393
-0.004919049925775985
-0.4227207162739552
-0.02977125012526515
-0.007329417521217866
-0.004799362072019235
-0.04928705209614159
0.01390028715087628
-0.06052762492298178
-0.05345393075857492
-0.01933503848687785
0.02412708421066096
0.7577027604454333
-0.01839223870153267
-0.03236552250268344
-0.03519355316730309
-0.002524949760420715
0.04653711715266551
0.03237155637530345
-0.04361070293698169
0.02231211902767126
-0.003510680870276059
0.02353040821555966
-0.0254038149997423
-0.03784234729221405
-0.01496325082239665
-0.1096407798484811
-0.02432005590765395
-0.02220298386454633
-0.01677558919271035
0.02793678682115618
0.05865980953771305
0.01189862934440359
0.03010765156485883
-0.03958992974761872
-0.007268775322255866
0.05294293416602704
-0.05502750543370474
-0.05673738760208438
0.03237936500603025
-0.03656633700260949
0.08779950730423459
0.006790834639854347
-0.02032745474793662
0.7695703963570237
0.04433003087446468
-0.007977099413222751
0.01903853926271193
-0.006688083616459144
0.01786406354663745
0.008944860461631317
0.01521866370519616
0.01282881192766641
0.08757989054147659
0.03029098635751108
0.08689630002836055
-0.07332525505085505
-0.02426049508349198
0.008876600633380447
0.0332247355061956
0.0006623997771954904
-0.0009713126614470242
-0.03447450093746116
-0.03387005791923073
0.001236515296012362
-0.06632461487973478
0.007180244726242392
0.01929265554492879
0.01262423053825323
0.04494232243043855
0.381847244814314
-0.02420143461265903
-0.05281461899262802
-0.07404402246060235
0.06219982013937868
-0.06710584398070213
-0.01428064838445891
0.02434126790735246
-0.008817709075897115
0.01304807967287548
0.01386922784904382
-0.4956987202620952
0.008880193353021325
-0.05575593048883049
-0.002999477883175723
0.01580559293417853
-0.04096013697370367
-0.1397397823290822
0.04796913224297291
-0.03528831331454151
-0.01930963225260023
-0.06034434737589266
0.02808574346295632
0.05300371881145107
-0.08576349702322304
0.04072590788203728
0.02856768774711061
-0.02675732181207342
0.04260892232551465
-0.03586021894614542
-0.005076667045608835
0.02055688594553516
0.04674172567352441
0.01768702088808452
-0.004253085055457585
0.01769437447460402
-0.1130155605605459
0.01563798131488654
0.03146925953562097
0.00578067373077747
-0.05091186684809928
0.02822084884992066
0.05198870296406718
0.04795569901666061
-0.01547663156895322
0.02441563660733269
-0.0220084768353289
0.05808944452346445
0.007488612521255081
-0.0528810591863027
0.03704898805414204
0.06429730232164488
0.0090263111273019
-0.01665121214365042
-0.0594053771851781
0.03883062955626006
-0.02931819826584414
0.07105070243567894
-0.04892529209748781
-0.002368795131715885
0.03396336329236651
-0.008355673519897256
0.02443715885441078
0.05063821508360851
-0.04760452682931962
0.01103205509960446
-0.04976577628744679
0.03241308232345911
-0.05236209498907154
-0.03548561988044904
-0.08583148155832544
0.04393178655555209
-0.05383483799701885
-0.009809016900605424
0.005117219639744494
0.001349466229688176
0.03424710092713721
-0.07353488596544272
0.009329928830276415
-0.02470134446004785
-0.02701709546890092
0.03653921437550529
-0.04758351646324147
0.01672772585124721
-0.03909622005201207
-0.03350971518494315
0.002271909914067561
-0.02956565832860192
0.0398967659880304
-0.01959665165229759
-0.005014691140159205
-0.01580050887694937
0.0009701646481252491
0.02590879551944818
-0.04971269273474017
0.01623226769728283
0.02509736799184389
0.05496877550732997
-0.008816472517643987
0.02541376714533053
0.0400827272581083
-0.03414080864104466
0.01113899380692569
0.01620371858395668
0.01126211249207191
0.0005146791071859885
-0.8289299174642933
0.03328409421147683
-0.0545872578084325
0.01709768338057793
0.02388068474882403
-0.03445744034192462
-0.0783517045889881
0.05394496996777345
-0.1100004251301942
0.02241106652976732
-0.04186501654370677
-0.03388405483109918
0.05100270137847532
0.005660289507782737
0.2622934663521542
-0.06332272217041185
-0.04511717497769103
-0.05027909446568993
0.001395383234741186
0.01892887309615163
0.0372875661717483
0.04345240384678473
0.04348542774291293
-0.0004091258895109387
0.02949321194843935
0.06562294649421148
0.04968441062512891
-0.003508565906524432
-1.074805975690828
-0.006288149410258503
-0.01326808613193844
0.01749576004117944
0.04054704497752763
-0.005815859512039445
0.007082841327201856
0.009008019138285245
0.03164238792070098
-0.06210358138457612
0.1229503945572952
0.4657266097169853
-0.6763232890378575
-0.001953022667268072
0.0303374975786215
-0.02152539692550859
-0.002809608615438371
0.01887524253698454
-0.00935963887741351
0.02544669438742172
-0.03264105437971124
0.01481242136079918
0.09920776647810632
-0.01917682580599034
0.03713143737744988
0.05207875709205374
0.01014856390215048
0.01172315788807495
-0.005105807488319421
-0.02947388724637841
-0.0437730544835681
-0.02726036597930221
0.06247860627798418
0.01704829808285117
-0.05830237176966429
-0.03942572266898866
-0.02286632742363719
-0.001706944833058656
-0.0490834085155995
-0.06522318224789078
0.04269959442613016
0.4632073887716364
-0.0133547419037892
0.01987982279742389
-0.01575250678029302
0.3714240832363875
-0.02495239264193774
-0.02063224969050126
-0.01507079047885605
-0.08483838550759659
-0.003877064022473863
-0.01169985447216338
0.7920284890377314
0.02828329478484754
-0.02776149181948679
0.03047286392259968
0.03171100195636802
-0.01112450476104299
-0.06490284486330228
-0.002875303546323377
-0.04465313198651998
0.04307529072273959
-0.02021835652388601
-0.04104126790357559
-0.0300686775548112
0.06701080035804109
0.002474138955349619
-0.0004200345830645094
-0.008228662848219876
-0.03822268266376418
-0.04724019332024576
-0.06982628941303656
-0.006798506574013439
-0.02398676291381948
0.04600473414792008
0.02219956476305993
0.04870774602861114
-0.002726572859915331
0.0001929095383402158
0.01696579526221467
0.07974665152200999
-0.00940285297888087
0.04169421170365025
0.02830667851865615
0.03505861368744555
-0.01086055323407925
-0.02519413265641305
0.02819303721651817
-0.07154573090708334
0.02001565677336983
0.006778093072014871
0.03564110558893731
-0.09055621957233166
0.02831415912609811
-0.01122883068335974
0.0243019612103578
0.01297331401290996
0.0420834142420095
0.05029719520336171
0.02797173361120127
0.01537919298376081
-0.01384550951688191
-0.01040379315509585
0.007981245594973688
0.0136468800641024
-0.01694688643685327
-0.02292955987593812
-0.04546252867719443
0.05098890307473682
0.08633849334292563
0.02309689325422743
-0.01577095470351248
-0.002998556635090464
0.006552554518716464
0.009827051478703932
0.0225387306025091
0.03853940657083939
0.03040266077888476
0.00102874593992139
-0.02775793071809888
0.03917503584477609
-0.02132153234629289
0.0232743952221428
-0.04607577013938076
-0.02145277965634261
-0.007357728320628847
0.01314877369077821
0.02979329660091595
0.001803591945865402
-0.01633298547321047
0.04835205460673683
-0.04136169925454089
-0.02939968066251688
-0.01592850208546893
-0.00331802496153753
-0.04985852156161761
0.1020687386488522
0.01723130157877083
0.02745074858361738
-0.02444742250284006
0.03437930975334488
0.0003131363343535483
0.8702086355343991
0.004332264745420283
-0.006009414802729402
0.01506224252010706
-0.8563567844107871
-0.005576654862342177
0.0330017037821921
0.002487322716770662
0.01457853394099293
-0.02700939513098826
-0.09726434123135627
0.05461486580576472
-0.05965542588873272
0.04738693281814164
0.03267809989337583
-0.04997322401498169
0.04277954749424175
