{
    "metamodel": "aom",
    "name": "m6",
    "concepts": [
        {
            "name": "Osoba",
            "type": "m6-aom",
            "general": [
                "aom:Coll"
            ]
        },
        {
            "name": "Dokument",
            "type": "m6-aom",
            "general": [
                "aom:Coll"
            ]
        },
        {
            "name": "dokument",
            "type": "m6-aom",
            "general": [
                "aom:Role"
            ]
        },
        {
            "name": "osoba",
            "type": "m6-aom",
            "general": [
                "aom:Role"
            ]
        },
        {
            "name": "Podpis",
            "type": "m6-aom",
            "general": [
                "aom:Assoc"
            ]
        }
    ],
    "particles" : [
        {
            "name": "Osoba",
            "atoms": [
                [
                    "aom_1",
                    "-"
                ],
                [
                    "aom_2",
                    "-"
                ]
            ],
            "concepts": [
                {
                    "substituting": "m6-aom:Osoba",
                    "substituted": "aom:Coll",
                    "kind": "concretization"
                }
            ],
            "base": "collection"
        },
        {
            "name": "Dokument",
            "atoms": [
                [
                    "aom_1",
                    "-"
                ],
                [
                    "aom_2",
                    "-"
                ]
            ],
            "concepts": [
                {
                    "substituting": "m6-aom:Dokument",
                    "substituted": "aom:Coll",
                    "kind": "concretization"
                }
            ],
            "base": "collection"
        },
        {
            "name": "Podpis",
            "atoms": [
                [
                    "aom_1",
                    "-"
                ],
                [
                    "aom_2",
                    "-"
                ]
            ],
            "concepts": [
                {
                    "substituting": "m6-aom:Podpis",
                    "substituted": "aom:Assoc",
                    "kind": "concretization"
                }
            ],
            "base": "association"
        },
        {
            "name": "dokument",
            "atoms": [
                [
                    "aom_5",
                    "-"
                ],
                [
                    "aom_6",
                    "+"
                ],
                [
                    "aom_7",
                    "-"
                ],
                [
                    "aom_8",
                    "-"
                ],
                [
                    "aom_9",
                    "-"
                ],
                [
                    "aom_10",
                    "+"
                ],
                [
                    "aom_11",
                    "-"
                ],
                [
                    "aom_12",
                    "-"
                ],
                "aom_25",
                "aom_26",
                "aom_27",
                "aom_28",
                [ "aom_24", "-"],
                [
                    "aom_21",
                    "+"
                ],
                [
                    "aom_23",
                    "+"
                ]
            ],
            "concepts": [
                {
                    "substituting": "m6-aom:dokument",
                    "substituted": "aom:Role",
                    "kind": "concretization"
                },
                {
                    "substituting": "m6-aom:Podpis",
                    "substituted": "aom:Assoc",
                    "kind": "concretization"
                },
                {
                    "substituting": "m6-aom:Dokument",
                    "substituted": {
                        "substituting": "role end",
                        "substituted": "aom:BaseNode",
                        "context": [
                            "aom_23"
                        ],
                        "kind": "concretization"
                    },
                    "kind": "concretization"
                },
                {
                    "substituting": "math:*",
                    "substituted": {
                        "substituting": "mult supreme in owner",
                        "substituted": "math:unlimited integer",
                        "context": [
                            "aom_25"
                        ],
                        "kind": "concretization"
                    },
                    "kind": "concretization"
                },
                {
                    "substituting": "math:0",
                    "substituted": {
                        "substituting": "mult inf in owner",
                        "substituted": "math:integer",
                        "context": [
                            "aom_26"
                        ],
                        "kind": "concretization"
                    },
                    "kind": "concretization"
                },
                {
                    "substituting": "math:*",
                    "substituted": {
                        "substituting": "mult supreme in dest",
                        "substituted": "math:unlimited integer",
                        "context": [
                            "aom_27"
                        ],
                        "kind": "concretization"
                    },
                    "kind": "concretization"
                },
                {
                    "substituting": "math:0",
                    "substituted": {
                        "substituting": "mult inf in dest",
                        "substituted": "math:integer",
                        "context": [
                            "aom_28"
                        ],
                        "kind": "concretization"
                    },
                    "kind": "concretization"
                }
            ],
            "base": "role"
        },
        {
            "name": "osoba",
            "atoms": [
                [
                    "aom_5",
                    "-"
                ],
                [
                    "aom_6",
                    "+"
                ],
                [
                    "aom_7",
                    "-"
                ],
                [
                    "aom_8",
                    "-"
                ],
                [
                    "aom_9",
                    "-"
                ],
                [
                    "aom_10",
                    "+"
                ],
                [
                    "aom_11",
                    "-"
                ],
                [
                    "aom_12",
                    "-"
                ],
                "aom_25",
                "aom_26",
                "aom_27",
                "aom_28",                
                [ "aom_24", "-"],
                [
                    "aom_21",
                    "+"
                ],
                [
                    "aom_23",
                    "+"
                ]
            ],
            "concepts": [
                {
                    "substituting": "m6-aom:osoba",
                    "substituted": "aom:Role",
                    "kind": "concretization"
                },
                {
                    "substituting": "m6-aom:Podpis",
                    "substituted": "aom:Assoc",
                    "kind": "concretization"
                },
                {
                    "substituting": "m6-aom:Osoba",
                    "substituted": {
                        "substituting": "role end",
                        "substituted": "aom:BaseNode",
                        "context": [
                            "aom_23"
                        ],
                        "kind": "concretization"
                    },
                    "kind": "concretization"
                },
                {
                    "substituting": "math:*",
                    "substituted": {
                        "substituting": "mult supreme in owner",
                        "substituted": "math:unlimited integer",
                        "context": [
                            "aom_25"
                        ],
                        "kind": "concretization"
                    },
                    "kind": "concretization"
                },
                {
                    "substituting": "math:0",
                    "substituted": {
                        "substituting": "mult inf in owner",
                        "substituted": "math:integer",
                        "context": [
                            "aom_26"
                        ],
                        "kind": "concretization"
                    },
                    "kind": "concretization"
                },
                {
                    "substituting": "math:*",
                    "substituted": {
                        "substituting": "mult supreme in dest",
                        "substituted": "math:unlimited integer",
                        "context": [
                            "aom_27"
                        ],
                        "kind": "concretization"
                    },
                    "kind": "concretization"
                },
                {
                    "substituting": "math:0",
                    "substituted": {
                        "substituting": "mult inf in dest",
                        "substituted": "math:integer",
                        "context": [
                            "aom_28"
                        ],
                        "kind": "concretization"
                    },
                    "kind": "concretization"
                }
            ],
            "base": "role"
        }
    ],
    "mappings": {
        "eer": [
            {
                "particle": "Osoba",
                "pattern": "coll_eer"
            },
            {
                "particle": "Dokument",
                "pattern": "coll_eer"
            },
            {
                "particle": "Podpis",
                "pattern": "assoc_eer",
                "alternative": 1
            },
            {
                "particle": "osoba",
                "pattern": "role_eer",
                "alternative": 0
            },
            {
                "particle": "dokument",
                "pattern": "role_eer",
                "alternative": 0
            }
        ],
        "uml" : [
            {
                "particle": "Osoba",
                "pattern": "coll_uml"
            },
            {
                "particle": "Dokument",
                "pattern": "coll_uml"
            },
            {
                "particle": "Podpis",
                "pattern": "assoc_uml",
                "alternative": 0
            },
            {
                "particle": "osoba",
                "pattern": "role_uml",
                "alternative": 0
            },
            {
                "particle": "dokument",
                "pattern": "role_uml",
                "alternative": 0
            }
        ],
        "orm" : [
            {
                "particle": "Osoba",
                "pattern": "coll_orm"
            },
            {
                "particle": "Dokument",
                "pattern": "coll_orm"
            },
            {
                "particle": "Podpis",
                "pattern": "assoc_orm"
            },
            {
                "particle": "osoba",
                "pattern": "role_orm"
            },
            {
                "particle": "dokument",
                "pattern": "role_orm"
            }
        ]
    }
}