{
    "name": "aom",
    "concepts": [
        {
            "name": "Db",
            "general": [
                "clom:model"
            ]
        },
        {
            "name": "BaseNode",
            "general": [
                "clom:classifier"
            ]
        },
        {
            "name": "Coll",
            "general": [
                "aom:BaseNode",
                "clom:entity type"
            ]
        },
        {
            "name": "Assoc",
            "general": [
                "aom:BaseNode",
                "clom:association"
            ]
        },
        {
            "name": "Attr",
            "general": [
                "clom:attribute"
            ]
        },
        {
            "name": "Role",
            "general": [
                "clom:role",
                "clom:association"
            ]
        },
        {
            "name": "Inheritance",
            "general": [
                "clom:categorization"
            ]
        },
        {
            "name": "Value",
            "general": [
                "clom:atomic entity"
            ]
        },
        {
            "name": "Composition",
            "general": []
        },
        {
            "name": "inOwner",
            "general": [
                "aom:Composition"
            ]
        },
        {
            "name": "inDest",
            "general": [
                "aom:Composition"
            ]
        },
        {
            "name": "inBoth",
            "general": [
                "aom:Composition"
            ]
        },
        {
            "name": "none",
            "general": [
                "aom:Composition"
            ]
        },
        {
            "name": "DataType",
            "general": [
                "clom:domain"
            ]
        },
        {
            "name": "int8",
            "general": [
                "aom:DataType"
            ]
        },
        {
            "name": "int16",
            "general": [
                "aom:DataType"
            ]
        },
        {
            "name": "int32",
            "general": [
                "aom:DataType"
            ]
        },
        {
            "name": "int64",
            "general": [
                "aom:DataType"
            ]
        },
        {
            "name": "float",
            "general": [
                "aom:DataType"
            ]
        },
        {
            "name": "double",
            "general": [
                "aom:DataType"
            ]
        },
        {
            "name": "bool",
            "general": [
                "aom:DataType"
            ]
        },
        {
            "name": "ascii",
            "general": [
                "aom:DataType"
            ]
        },
        {
            "name": "unicode",
            "general": [
                "aom:DataType"
            ]
        },
        {
            "name": "date",
            "general": [
                "aom:DataType"
            ]
        },
        {
            "name": "time",
            "general": [
                "aom:DataType"
            ]
        },
        {
            "name": "datetime",
            "general": [
                "aom:DataType"
            ]
        },
        {
            "name": "object",
            "general": [
                "aom:DataType"
            ]
        },
        {
            "name": "reference",
            "general": [
                "aom:DataType"
            ]
        },
        {
            "name": "byte",
            "general": [
                "aom:DataType"
            ]
        },
        {
            "name": "ascii-string",
            "general": [
                "aom:DataType"
            ]
        },
        {
            "name": "unicode-string",
            "general": [
                "aom:DataType"
            ]
        },
        {
            "name": "byte-array",
            "general": [
                "aom:DataType"
            ]
        },
        {
            "name": "Direction",
            "general": []
        },
        {
            "name": "toOwner",
            "general": [
                "aom:Direction"
            ]
        },
        {
            "name": "toDest",
            "general": [
                "aom:Direction"
            ]
        },
        {
            "name": "biDir",
            "general": [
                "aom:Direction"
            ]
        },
        {
            "name": "Inheritability",
            "general": []
        },
        {
            "name": "disable",
            "general": [
                "aom:Inheritability"
            ]
        },
        {
            "name": "nochange",
            "general": [
                "aom:Inheritability"
            ]
        },
        {
            "name": "none",
            "general": [
                "aom:Inheritability"
            ]
        },
        {
            "name": "Navigability",
            "general": []
        },
        {
            "name": "uniNav",
            "general": [
                "aom:Navigability"
            ]
        },
        {
            "name": "biNav",
            "general": [
                "aom:Navigability"
            ]
        },
        {
            "name": "Virtuality",
            "general": []
        },
        {
            "name": "natural",
            "general": [
                "aom:Virtuality"
            ]
        },
        {
            "name": "virtual",
            "general": [
                "aom:Virtuality"
            ]
        },
        {
            "name": "real",
            "general": [
                "aom:Virtuality"
            ]
        }
    ],
    "atoms": [
        {
            "id": "1",
            "concepts": [
                "aom:BaseNode"
            ],
            "verbalization": "{0} can be abstract",
            "is_possibilistic": true
        },
        {
            "id": "2",
            "concepts": [
                "aom:BaseNode"
            ],
            "verbalization": "{0} can be uninavigable",
            "is_possibilistic": true
        },
        {
            "id": "3",
            "concepts": [
                "aom:Attr"
            ],
            "verbalization": "{0} can be inheritable",
            "is_possibilistic": true
        },
        {
            "id": "4",
            "concepts": [
                "aom:Attr"
            ],
            "verbalization": "{0} can be virtual",
            "is_possibilistic": true
        },
        {
            "id": "5",
            "concepts": [
                "aom:Role"
            ],
            "verbalization": "{0} can be virtual",
            "is_possibilistic": true
        },
        {
            "id": "6",
            "concepts": [
                "aom:Role"
            ],
            "verbalization": "{0} can be inheritable",
            "is_possibilistic": true
        },
        {
            "id": "7",
            "concepts": [
                "aom:Role"
            ],
            "verbalization": "{0} can be uninavigable",
            "is_possibilistic": true
        },
        {
            "id": "8",
            "concepts": [
                "aom:Role"
            ],
            "verbalization": "{0} can be directed to owner",
            "is_possibilistic": true
        },
        {
            "id": "9",
            "concepts": [
                "aom:Role"
            ],
            "verbalization": "{0} can be directed to dest",
            "is_possibilistic": true
        },
        {
            "id": "10",
            "concepts": [
                "aom:Role"
            ],
            "verbalization": "{0} can be bidirectional",
            "is_possibilistic": true
        },
        {
            "id": "11",
            "concepts": [
                "aom:Role"
            ],
            "verbalization": "{0} can have composition in owner",
            "is_possibilistic": true
        },
        {
            "id": "12",
            "concepts": [
                "aom:Role"
            ],
            "verbalization": "{0} can have composition in dest",
            "is_possibilistic": true
        },
        {
            "id": "13",
            "concepts": [
                [
                    "aom:BaseNode",
                    "BaseNode_1"
                ],
                [
                    "aom:BaseNode",
                    "BaseNode_2"
                ]
            ],
            "verbalization": "{0} can inherit from {1}",
            "is_possibilistic": true
        },
        {
            "id": "14",
            "concepts": [
                "aom:Inheritance",
                "aom:Inheritability"
            ],
            "verbalization": "{0} is of type {1} in aspect of member inheritance",
            "is_possibilistic": false
        },
        {
            "id": "15",
            "concepts": [
                "aom:Inheritance",
                "aom:Inheritability"
            ],
            "verbalization": "{0} is of type {1} in aspect of right to fulfill roles inheritance",
            "is_possibilistic": false
        },
        {
            "id": "16",
            "concepts": [
                "aom:Inheritance",
                "aom:Virtuality"
            ],
            "verbalization": "{0} is of type {1} in terms of virtuality",
            "is_possibilistic": false
        },
        {
            "id": "17",
            "concepts": [
                "aom:Coll",
                "aom:Attr"
            ],
            "verbalization": "{0} can have {1}",
            "is_possibilistic": true
        },
        {
            "id": "18",
            "concepts": [
                "aom:Attr",
                "math:positive integer"
            ],
            "verbalization": "{0} has cardinality of {1}",
            "is_possibilistic": false
        },
        {
            "id": "19",
            "concepts": [
                "aom:Attr",
                "aom:DataType"
            ],
            "verbalization": "{0} is of type {1}",
            "is_possibilistic": false
        },
        {
            "id": "20",
            "concepts": [
                "aom:Attr",
                "aom:Value"
            ],
            "verbalization": "{0} has default value {1}",
            "is_possibilistic": false
        },
        {
            "id": "21",
            "concepts": [
                "aom:Assoc",
                "aom:Role"
            ],
            "verbalization": "{0} can have {1}",
            "is_possibilistic": true
        },
        {
            "id": "22",
            "concepts": [
                "aom:Assoc",
                "aom:Coll"
            ],
            "verbalization": "{0} can be described by {1}",
            "is_possibilistic": true
        },
        {
            "id": "23",
            "concepts": [
                "aom:BaseNode",
                "aom:Role"
            ],
            "verbalization": "{0} can participate in {1}",
            "is_possibilistic": true
        },
        {
            "id": "24",
            "concepts": [
                "aom:Role",
                "math:positive integer"
            ],
            "verbalization": "{0} can have uniqueness equal to {1}",
            "is_possibilistic": true
        },
        {
            "id": "25",
            "concepts": [
                "aom:Role",
                "math:unlimited integer"
            ],
            "verbalization": "{0} has upper bound equal to {1} in owner",
            "is_possibilistic": false
        },
        {
            "id": "26",
            "concepts": [
                "aom:Role",
                "math:integer"
            ],
            "verbalization": "{0} has lower bound equal to {1} in owner",
            "is_possibilistic": false
        },
        {
            "id": "27",
            "concepts": [
                "aom:Role",
                "math:unlimited integer"
            ],
            "verbalization": "{0} has upper bound equal to {1} in dest",
            "is_possibilistic": false
        },
        {
            "id": "28",
            "concepts": [
                "aom:Role",
                "math:integer"
            ],
            "verbalization": "{0} has lower bound equal to {1} in dest",
            "is_possibilistic": false
        },
        {
            "id": "29",
            "concepts": [
                "aom:Role",
                "aom:Coll"
            ],
            "verbalization": "{0} can be described by {1}",
            "is_possibilistic": true
        }
    ],
    "particles": [
        {
            "name": "collection",
            "model": "aom",
            "atoms": [
                "aom_1",
                "aom_2"
            ],
            "concepts": [
                {
                    "substituting": "aom:Coll",
                    "substituted": "aom:BaseNode",
                    "kind": "categorization"
                }
            ]
        },
        {
            "name": "association",
            "model": "aom",
            "atoms": [
                "aom_1",
                "aom_2"
            ],
            "concepts": [
                {
                    "substituting": "aom:Assoc",
                    "substituted": "aom:BaseNode",
                    "kind": "categorization"
                }
            ]
        },
        {
            "name": "attribute",
            "model": "aom",
            "atoms": [
                "aom_3",
                "aom_4",
                [
                    "aom_17",
                    "+"
                ],
                "aom_18",
                "aom_19",
                "aom_20"
            ],
            "concepts": [
                "aom:Attr",
                "aom:Coll",
                "aom:Value",
                "aom:DataType",
                {
                    "substituting": "attribute multiplicity",
                    "substituted": "math:positive integer",
                    "context": [
                        "aom_18"
                    ],
                    "kind": "concretization"
                }
            ]
        },
        {
            "name": "role",
            "model": "aom",
            "atoms": [
                "aom_5",
                "aom_6",
                "aom_7",
                "aom_8",
                "aom_9",
                "aom_10",
                "aom_11",
                "aom_12",
                "aom_25",
                "aom_26",
                "aom_27",
                "aom_28",
                "aom_24",
                [
                    "aom_21",
                    "+"
                ],
                [
                    "aom_23",
                    "+"
                ]
            ],
            "concepts": [
                "aom:Role",
                "aom:Assoc",
                {
                    "substituting": "role end",
                    "substituted": "aom:BaseNode",
                    "context": [
                        "aom_23"
                    ],
                    "kind": "concretization"
                },
                {
                    "substituting": "mult supreme in owner",
                    "substituted": "math:unlimited integer",
                    "context": [
                        "aom_25"
                    ],
                    "kind": "concretization"
                },
                {
                    "substituting": "mult inf in owner",
                    "substituted": "math:integer",
                    "context": [
                        "aom_26"
                    ],
                    "kind": "concretization"
                },
                {
                    "substituting": "mult supreme in dest",
                    "substituted": "math:unlimited integer",
                    "context": [
                        "aom_27"
                    ],
                    "kind": "concretization"
                },
                {
                    "substituting": "mult inf in dest",
                    "substituted": "math:integer",
                    "context": [
                        "aom_28"
                    ],
                    "kind": "concretization"
                }
            ]
        },
        {
            "name": "association description",
            "model": "aom",
            "atoms": [
                [
                    "aom_22",
                    "+"
                ]
            ],
            "concepts": [
                "aom:Assoc",
                "aom:Coll"
            ]
        },
        {
            "name": "role description",
            "model": "aom",
            "atoms": [
                [
                    "aom_29",
                    "+"
                ]
            ],
            "concepts": [
                "aom:Role",
                "aom:Coll"
            ]
        },
        {
            "name": "inheritance",
            "model": "aom",
            "atoms": [
                [
                    "aom_13",
                    "+"
                ],
                "aom_14",
                "aom_15",
                "aom_16"
            ],
            "concepts": [
                [
                    "aom:BaseNode",
                    "BaseNode_1"
                ],
                [
                    "aom:BaseNode",
                    "BaseNode_2"
                ],
                "aom:Inheritance",
                "aom:Virtuality",
                {
                    "substituting": "member inheritance aspect",
                    "substituted": "aom:Inheritability",
                    "context": [
                        "aom_14"
                    ],
                    "kind": "concretization"
                },
                {
                    "substituting": "fulfill roles inheritance aspect",
                    "substituted": "aom:Inheritability",
                    "context": [
                        "aom_15"
                    ],
                    "kind": "concretization"
                }
            ]
        },
        {
            "name": "bact",
            "model": "aom",
            "atoms": [
                "aom_1",
                [
                    "aom_2",
                    "-"
                ],
                [
                    "aom_11",
                    "+"
                ],
                [
                    "aom_12",
                    "+"
                ],
                "aom_25",
                "aom_26",
                "aom_27",
                "aom_28",
                [
                    "aom_21",
                    "+"
                ],
                [
                    "aom_23",
                    "+"
                ]
            ],
            "concepts": [
                {
                    "substituting": "data aspect",
                    "substituted": "aom:Coll",
                    "kind": "concretization"
                },
                {
                    "substituting": "relationship aspect",
                    "substituted": "aom:Assoc",
                    "kind": "concretization"
                },
                {
                    "substituting": "unbreakable connection",
                    "substituted": "aom:Role",
                    "kind": "concretization"
                },
                {
                    "substituting": "data aspect",
                    "substituted": "role end",
                    "context": [
                        "aom_23"
                    ],
                    "kind": "concretization"
                },
                {
                    "substituting": "math:1",
                    "substituted": "math:unlimited integer",
                    "kind": "concretization"
                }
            ]
        }
    ]
}
