{
    "metamodel": "aom",
    "name": "m1",
    "concepts": [
        {
            "name": "OSOBA",
            "type": "m1-aom",
            "general": [
                "aom:Coll"
            ]
        }
    ],
    "particles" : [
        {
            "name": "Osoba",
            "atoms": [
                [
                    "aom_1",
                    "-"
                ],
                [
                    "aom_2",
                    "-"
                ]
            ],
            "concepts": [
                {
                    "substituting": "m1-aom:OSOBA",
                    "substituted": "aom:Coll",
                    "kind": "concretization"
                }
            ],
            "base": "collection"
        }
    ],
    "mappings": {
        "eer": [
            {
                "particle": "Osoba",
                "pattern": "coll_eer"
            }
        ],
        "uml" : [
            {
                "particle": "Osoba",
                "pattern": "coll_uml"
            }
        ],
        "orm" : [
            {
                "particle": "Osoba",
                "pattern": "coll_orm"
            }
        ]
    }
}