// Jest Snapshot v1, https://goo.gl/fbAQLP

exports[`<BrDatePicker /> deveria adicionar label informado 1`] = `
<div
  class="br-datetimepicker"
>
  <div
    class="br-input has-icon"
  >
    <label
      for="date-picker-2-input"
    >
      Meu BrDatePicker
    </label>
    <input
      aria-label="Meu BrDatePicker"
      class="has-icon flatpickr-input"
      id="date-picker-2-input"
      placeholder="dd/mm/aaaa"
      readonly="readonly"
      type="text"
    />
    <button
      aria-label="Abrir Datepicker"
      class="br-button circle small"
      id="date-picker-2-button"
      type="button"
    >
      <i
        class="fas fa-calendar-alt"
      />
    </button>
  </div>
</div>
`;

exports[`<BrDatePicker /> deveria renderizar o date picker 1`] = `
<div
  class="br-datetimepicker"
>
  <div
    class="br-input has-icon"
  >
    <input
      class="has-icon flatpickr-input"
      id="date-picker-1-input"
      placeholder="dd/mm/aaaa"
      readonly="readonly"
      type="text"
    />
    <button
      aria-label="Abrir Datepicker"
      class="br-button circle small"
      id="date-picker-1-button"
      type="button"
    >
      <i
        class="fas fa-calendar-alt"
      />
    </button>
  </div>
</div>
`;
