[{
    "NombreEmpleado": "Jan",
    "ApellidoEmpleado": "Drinkeld",
    "TipoPermisoId": 3,
    "FechaPermiso": "4/3/2023"
}, {
    "NombreEmpleado": "Baillie",
    "ApellidoEmpleado": "Grafton-Herbert",
    "TipoPermisoId": 1,
    "FechaPermiso": "3/12/2023"
}, {
    "NombreEmpleado": "Torie",
    "ApellidoEmpleado": "Franceschi",
    "TipoPermisoId": 4,
    "FechaPermiso": "4/1/2023"
}, {
    "NombreEmpleado": "Cathe",
    "ApellidoEmpleado": "Rapport",
    "TipoPermisoId": 4,
    "FechaPermiso": "3/21/2023"
}, {
    "NombreEmpleado": "Cindy",
    "ApellidoEmpleado": "McGowan",
    "TipoPermisoId": 3,
    "FechaPermiso": "3/28/2023"
}, {
    "NombreEmpleado": "Lombard",
    "ApellidoEmpleado": "Broke",
    "TipoPermisoId": 3,
    "FechaPermiso": "3/12/2023"
}, {
    "NombreEmpleado": "Mel",
    "ApellidoEmpleado": "Frane",
    "TipoPermisoId": 2,
    "FechaPermiso": "3/30/2023"
}, {
    "NombreEmpleado": "Niles",
    "ApellidoEmpleado": "Baruch",
    "TipoPermisoId": 4,
    "FechaPermiso": "3/19/2023"
}, {
    "NombreEmpleado": "Corri",
    "ApellidoEmpleado": "Pimley",
    "TipoPermisoId": 3,
    "FechaPermiso": "4/4/2023"
}, {
    "NombreEmpleado": "Seth",
    "ApellidoEmpleado": "Clothier",
    "TipoPermisoId": 2,
    "FechaPermiso": "3/8/2023"
}, {
    "NombreEmpleado": "Dorena",
    "ApellidoEmpleado": "Carder",
    "TipoPermisoId": 4,
    "FechaPermiso": "3/19/2023"
}, {
    "NombreEmpleado": "Fidelio",
    "ApellidoEmpleado": "Jeffcoate",
    "TipoPermisoId": 2,
    "FechaPermiso": "3/24/2023"
}, {
    "NombreEmpleado": "Marjorie",
    "ApellidoEmpleado": "Casserley",
    "TipoPermisoId": 1,
    "FechaPermiso": "3/3/2023"
}, {
    "NombreEmpleado": "Armando",
    "ApellidoEmpleado": "Scanderet",
    "TipoPermisoId": 2,
    "FechaPermiso": "3/30/2023"
}, {
    "NombreEmpleado": "Carlye",
    "ApellidoEmpleado": "Gadie",
    "TipoPermisoId": 2,
    "FechaPermiso": "3/25/2023"
}, {
    "NombreEmpleado": "Becca",
    "ApellidoEmpleado": "Askie",
    "TipoPermisoId": 2,
    "FechaPermiso": "4/6/2023"
}, {
    "NombreEmpleado": "Tiffany",
    "ApellidoEmpleado": "Blackaller",
    "TipoPermisoId": 1,
    "FechaPermiso": "3/23/2023"
}, {
    "NombreEmpleado": "Raleigh",
    "ApellidoEmpleado": "Tregent",
    "TipoPermisoId": 3,
    "FechaPermiso": "3/2/2023"
}, {
    "NombreEmpleado": "Jaquith",
    "ApellidoEmpleado": "Cram",
    "TipoPermisoId": 4,
    "FechaPermiso": "3/18/2023"
}, {
    "NombreEmpleado": "Delainey",
    "ApellidoEmpleado": "Tynan",
    "TipoPermisoId": 3,
    "FechaPermiso": "3/22/2023"
}]