{
  "name": "mikemurray86-vss",
  "version": "0.1.0",
  "author": "Mike Murray",
  "summary": "This module controls VSS on windows systems",
  "license": "GPL-3.0",
  "source": "https://gitlab.com/mikemurray86/puppet-vss",
  "issues_url": "https://gitlab.com/mikemurray86/puppet-vss/issues",
  "dependencies": [
    { "name": "puppetlabs/stdlib", "version_requirement": ">= 3.2.0 <5.0.0" }
  ],
  "tags": [
      "windows",
      "Volume-Shadow-Copy",
      "vss"
  ],
  "operatingsystem_support": [
    {
      "operatingsystem": "windows",
      "operatingsystemrelease": [
        "2008 R2",
        "2012 R2",
        "10"
      ]
    }
  ],
  "requirements": [
    {
      "name": "puppet",
      "version_requirement": ">= 4.7.0 < 6.0.0"
    }
  ]
}
