


ARM Macro Assembler    Page 1 


    1 00000000         ;******************** (C) COPYRIGHT 2011 STMicroelectron
                       ics ********************
    2 00000000         ;* File Name          : startup_stm32f10x_md.s
    3 00000000         ;* Author             : MCD Application Team
    4 00000000         ;* Version            : V3.5.0
    5 00000000         ;* Date               : 11-March-2011
    6 00000000         ;* Description        : STM32F10x Medium Density Devices
                        vector table for MDK-ARM 
    7 00000000         ;*                      toolchain.  
    8 00000000         ;*                      This module performs:
    9 00000000         ;*                      - Set the initial SP
   10 00000000         ;*                      - Set the initial PC == Reset_Ha
                       ndler
   11 00000000         ;*                      - Set the vector table entries w
                       ith the exceptions ISR address
   12 00000000         ;*                      - Configure the clock system
   13 00000000         ;*                      - Branches to __main in the C li
                       brary (which eventually
   14 00000000         ;*                        calls main()).
   15 00000000         ;*                      After Reset the CortexM3 process
                       or is in Thread mode,
   16 00000000         ;*                      priority is Privileged, and the 
                       Stack is set to Main.
   17 00000000         ;* <<< Use Configuration Wizard in Context Menu >>>   
   18 00000000         ;*******************************************************
                       ************************
   19 00000000         ; THE PRESENT FIRMWARE WHICH IS FOR GUIDANCE ONLY AIMS A
                       T PROVIDING CUSTOMERS
   20 00000000         ; WITH CODING INFORMATION REGARDING THEIR PRODUCTS IN OR
                       DER FOR THEM TO SAVE TIME.
   21 00000000         ; AS A RESULT, STMICROELECTRONICS SHALL NOT BE HELD LIAB
                       LE FOR ANY DIRECT,
   22 00000000         ; INDIRECT OR CONSEQUENTIAL DAMAGES WITH RESPECT TO ANY 
                       CLAIMS ARISING FROM THE
   23 00000000         ; CONTENT OF SUCH FIRMWARE AND/OR THE USE MADE BY CUSTOM
                       ERS OF THE CODING
   24 00000000         ; INFORMATION CONTAINED HEREIN IN CONNECTION WITH THEIR 
                       PRODUCTS.
   25 00000000         ;*******************************************************
                       ************************
   26 00000000         
   27 00000000         ; Amount of memory (in bytes) allocated for Stack
   28 00000000         ; Tailor this value to your application needs
   29 00000000         ; <h> Stack Configuration
   30 00000000         ;   <o> Stack Size (in Bytes) <0x0-0xFFFFFFFF:8>
   31 00000000         ; </h>
   32 00000000         
   33 00000000 00000400 
                       Stack_Size
                               EQU              0x00000400
   34 00000000         
   35 00000000                 AREA             STACK, NOINIT, READWRITE, ALIGN
=3
   36 00000000         Stack_Mem
                               SPACE            Stack_Size
   37 00000400         __initial_sp
   38 00000400         
   39 00000400         
   40 00000400         ; <h> Heap Configuration



ARM Macro Assembler    Page 2 


   41 00000400         ;   <o>  Heap Size (in Bytes) <0x0-0xFFFFFFFF:8>
   42 00000400         ; </h>
   43 00000400         
   44 00000400 00000200 
                       Heap_Size
                               EQU              0x00000200
   45 00000400         
   46 00000400                 AREA             HEAP, NOINIT, READWRITE, ALIGN=
3
   47 00000000         __heap_base
   48 00000000         Heap_Mem
                               SPACE            Heap_Size
   49 00000200         __heap_limit
   50 00000200         
   51 00000200                 PRESERVE8
   52 00000200                 THUMB
   53 00000200         
   54 00000200         
   55 00000200         ; Vector Table Mapped to Address 0 at Reset
   56 00000200                 AREA             RESET, DATA, READONLY
   57 00000000                 EXPORT           __Vectors
   58 00000000                 EXPORT           __Vectors_End
   59 00000000                 EXPORT           __Vectors_Size
   60 00000000         
   61 00000000 00000000 
                       __Vectors
                               DCD              __initial_sp ; Top of Stack
   62 00000004 00000000        DCD              Reset_Handler ; Reset Handler
   63 00000008 00000000        DCD              NMI_Handler ; NMI Handler
   64 0000000C 00000000        DCD              HardFault_Handler ; Hard Fault 
                                                            Handler
   65 00000010 00000000        DCD              MemManage_Handler 
                                                            ; MPU Fault Handler
                                                            
   66 00000014 00000000        DCD              BusFault_Handler 
                                                            ; Bus Fault Handler
                                                            
   67 00000018 00000000        DCD              UsageFault_Handler ; Usage Faul
                                                            t Handler
   68 0000001C 00000000        DCD              0           ; Reserved
   69 00000020 00000000        DCD              0           ; Reserved
   70 00000024 00000000        DCD              0           ; Reserved
   71 00000028 00000000        DCD              0           ; Reserved
   72 0000002C 00000000        DCD              SVC_Handler ; SVCall Handler
   73 00000030 00000000        DCD              DebugMon_Handler ; Debug Monito
                                                            r Handler
   74 00000034 00000000        DCD              0           ; Reserved
   75 00000038 00000000        DCD              PendSV_Handler ; PendSV Handler
                                                            
   76 0000003C 00000000        DCD              SysTick_Handler 
                                                            ; SysTick Handler
   77 00000040         
   78 00000040         ; External Interrupts
   79 00000040 00000000        DCD              WWDG_IRQHandler 
                                                            ; Window Watchdog
   80 00000044 00000000        DCD              PVD_IRQHandler ; PVD through EX
                                                            TI Line detect
   81 00000048 00000000        DCD              TAMPER_IRQHandler ; Tamper
   82 0000004C 00000000        DCD              RTC_IRQHandler ; RTC



ARM Macro Assembler    Page 3 


   83 00000050 00000000        DCD              FLASH_IRQHandler ; Flash
   84 00000054 00000000        DCD              RCC_IRQHandler ; RCC
   85 00000058 00000000        DCD              EXTI0_IRQHandler ; EXTI Line 0
   86 0000005C 00000000        DCD              EXTI1_IRQHandler ; EXTI Line 1
   87 00000060 00000000        DCD              EXTI2_IRQHandler ; EXTI Line 2
   88 00000064 00000000        DCD              EXTI3_IRQHandler ; EXTI Line 3
   89 00000068 00000000        DCD              EXTI4_IRQHandler ; EXTI Line 4
   90 0000006C 00000000        DCD              DMA1_Channel1_IRQHandler 
                                                            ; DMA1 Channel 1
   91 00000070 00000000        DCD              DMA1_Channel2_IRQHandler 
                                                            ; DMA1 Channel 2
   92 00000074 00000000        DCD              DMA1_Channel3_IRQHandler 
                                                            ; DMA1 Channel 3
   93 00000078 00000000        DCD              DMA1_Channel4_IRQHandler 
                                                            ; DMA1 Channel 4
   94 0000007C 00000000        DCD              DMA1_Channel5_IRQHandler 
                                                            ; DMA1 Channel 5
   95 00000080 00000000        DCD              DMA1_Channel6_IRQHandler 
                                                            ; DMA1 Channel 6
   96 00000084 00000000        DCD              DMA1_Channel7_IRQHandler 
                                                            ; DMA1 Channel 7
   97 00000088 00000000        DCD              ADC1_2_IRQHandler ; ADC1_2
   98 0000008C 00000000        DCD              USB_HP_CAN1_TX_IRQHandler ; USB
                                                             High Priority or C
                                                            AN1 TX
   99 00000090 00000000        DCD              USB_LP_CAN1_RX0_IRQHandler ; US
                                                            B Low  Priority or 
                                                            CAN1 RX0
  100 00000094 00000000        DCD              CAN1_RX1_IRQHandler ; CAN1 RX1
  101 00000098 00000000        DCD              CAN1_SCE_IRQHandler ; CAN1 SCE
  102 0000009C 00000000        DCD              EXTI9_5_IRQHandler 
                                                            ; EXTI Line 9..5
  103 000000A0 00000000        DCD              TIM1_BRK_IRQHandler 
                                                            ; TIM1 Break
  104 000000A4 00000000        DCD              TIM1_UP_IRQHandler 
                                                            ; TIM1 Update
  105 000000A8 00000000        DCD              TIM1_TRG_COM_IRQHandler ; TIM1 
                                                            Trigger and Commuta
                                                            tion
  106 000000AC 00000000        DCD              TIM1_CC_IRQHandler ; TIM1 Captu
                                                            re Compare
  107 000000B0 00000000        DCD              TIM2_IRQHandler ; TIM2
  108 000000B4 00000000        DCD              TIM3_IRQHandler ; TIM3
  109 000000B8 00000000        DCD              TIM4_IRQHandler ; TIM4
  110 000000BC 00000000        DCD              I2C1_EV_IRQHandler ; I2C1 Event
                                                            
  111 000000C0 00000000        DCD              I2C1_ER_IRQHandler ; I2C1 Error
                                                            
  112 000000C4 00000000        DCD              I2C2_EV_IRQHandler ; I2C2 Event
                                                            
  113 000000C8 00000000        DCD              I2C2_ER_IRQHandler ; I2C2 Error
                                                            
  114 000000CC 00000000        DCD              SPI1_IRQHandler ; SPI1
  115 000000D0 00000000        DCD              SPI2_IRQHandler ; SPI2
  116 000000D4 00000000        DCD              USART1_IRQHandler ; USART1
  117 000000D8 00000000        DCD              USART2_IRQHandler ; USART2
  118 000000DC 00000000        DCD              USART3_IRQHandler ; USART3
  119 000000E0 00000000        DCD              EXTI15_10_IRQHandler 
                                                            ; EXTI Line 15..10



ARM Macro Assembler    Page 4 


  120 000000E4 00000000        DCD              RTCAlarm_IRQHandler ; RTC Alarm
                                                             through EXTI Line
  121 000000E8 00000000        DCD              USBWakeUp_IRQHandler ; USB Wake
                                                            up from suspend
  122 000000EC         __Vectors_End
  123 000000EC         
  124 000000EC 000000EC 
                       __Vectors_Size
                               EQU              __Vectors_End - __Vectors
  125 000000EC         
  126 000000EC                 AREA             |.text|, CODE, READONLY
  127 00000000         
  128 00000000         ; Reset handler
  129 00000000         Reset_Handler
                               PROC
  130 00000000                 EXPORT           Reset_Handler             [WEAK
]
  131 00000000                 IMPORT           __main
  132 00000000 4808            LDR              R0, =__main
  133 00000002 4780            BLX              R0
  134 00000004         
  135 00000004                 ENDP
  136 00000004         
  137 00000004         ; Dummy Exception Handlers (infinite loops which can be 
                       modified)
  138 00000004         
  139 00000004         NMI_Handler
                               PROC
  140 00000004                 EXPORT           NMI_Handler                [WEA
K]
  141 00000004 E7FE            B                .
  142 00000006                 ENDP
  144 00000006         HardFault_Handler
                               PROC
  145 00000006                 EXPORT           HardFault_Handler          [WEA
K]
  146 00000006 E7FE            B                .
  147 00000008                 ENDP
  149 00000008         MemManage_Handler
                               PROC
  150 00000008                 EXPORT           MemManage_Handler          [WEA
K]
  151 00000008 E7FE            B                .
  152 0000000A                 ENDP
  154 0000000A         BusFault_Handler
                               PROC
  155 0000000A                 EXPORT           BusFault_Handler           [WEA
K]
  156 0000000A E7FE            B                .
  157 0000000C                 ENDP
  159 0000000C         UsageFault_Handler
                               PROC
  160 0000000C                 EXPORT           UsageFault_Handler         [WEA
K]
  161 0000000C E7FE            B                .
  162 0000000E                 ENDP
  163 0000000E         SVC_Handler
                               PROC
  164 0000000E                 EXPORT           SVC_Handler                [WEA



ARM Macro Assembler    Page 5 


K]
  165 0000000E E7FE            B                .
  166 00000010                 ENDP
  168 00000010         DebugMon_Handler
                               PROC
  169 00000010                 EXPORT           DebugMon_Handler           [WEA
K]
  170 00000010 E7FE            B                .
  171 00000012                 ENDP
  172 00000012         PendSV_Handler
                               PROC
  173 00000012                 EXPORT           PendSV_Handler             [WEA
K]
  174 00000012 E7FE            B                .
  175 00000014                 ENDP
  176 00000014         SysTick_Handler
                               PROC
  177 00000014                 EXPORT           SysTick_Handler            [WEA
K]
  178 00000014 E7FE            B                .
  179 00000016                 ENDP
  180 00000016         
  181 00000016         Default_Handler
                               PROC
  182 00000016         
  183 00000016                 EXPORT           WWDG_IRQHandler            [WEA
K]
  184 00000016                 EXPORT           PVD_IRQHandler             [WEA
K]
  185 00000016                 EXPORT           TAMPER_IRQHandler          [WEA
K]
  186 00000016                 EXPORT           RTC_IRQHandler             [WEA
K]
  187 00000016                 EXPORT           FLASH_IRQHandler           [WEA
K]
  188 00000016                 EXPORT           RCC_IRQHandler             [WEA
K]
  189 00000016                 EXPORT           EXTI0_IRQHandler           [WEA
K]
  190 00000016                 EXPORT           EXTI1_IRQHandler           [WEA
K]
  191 00000016                 EXPORT           EXTI2_IRQHandler           [WEA
K]
  192 00000016                 EXPORT           EXTI3_IRQHandler           [WEA
K]
  193 00000016                 EXPORT           EXTI4_IRQHandler           [WEA
K]
  194 00000016                 EXPORT           DMA1_Channel1_IRQHandler   [WEA
K]
  195 00000016                 EXPORT           DMA1_Channel2_IRQHandler   [WEA
K]
  196 00000016                 EXPORT           DMA1_Channel3_IRQHandler   [WEA
K]
  197 00000016                 EXPORT           DMA1_Channel4_IRQHandler   [WEA
K]
  198 00000016                 EXPORT           DMA1_Channel5_IRQHandler   [WEA
K]
  199 00000016                 EXPORT           DMA1_Channel6_IRQHandler   [WEA
K]



ARM Macro Assembler    Page 6 


  200 00000016                 EXPORT           DMA1_Channel7_IRQHandler   [WEA
K]
  201 00000016                 EXPORT           ADC1_2_IRQHandler          [WEA
K]
  202 00000016                 EXPORT           USB_HP_CAN1_TX_IRQHandler  [WEA
K]
  203 00000016                 EXPORT           USB_LP_CAN1_RX0_IRQHandler [WEA
K]
  204 00000016                 EXPORT           CAN1_RX1_IRQHandler        [WEA
K]
  205 00000016                 EXPORT           CAN1_SCE_IRQHandler        [WEA
K]
  206 00000016                 EXPORT           EXTI9_5_IRQHandler         [WEA
K]
  207 00000016                 EXPORT           TIM1_BRK_IRQHandler        [WEA
K]
  208 00000016                 EXPORT           TIM1_UP_IRQHandler         [WEA
K]
  209 00000016                 EXPORT           TIM1_TRG_COM_IRQHandler    [WEA
K]
  210 00000016                 EXPORT           TIM1_CC_IRQHandler         [WEA
K]
  211 00000016                 EXPORT           TIM2_IRQHandler            [WEA
K]
  212 00000016                 EXPORT           TIM3_IRQHandler            [WEA
K]
  213 00000016                 EXPORT           TIM4_IRQHandler            [WEA
K]
  214 00000016                 EXPORT           I2C1_EV_IRQHandler         [WEA
K]
  215 00000016                 EXPORT           I2C1_ER_IRQHandler         [WEA
K]
  216 00000016                 EXPORT           I2C2_EV_IRQHandler         [WEA
K]
  217 00000016                 EXPORT           I2C2_ER_IRQHandler         [WEA
K]
  218 00000016                 EXPORT           SPI1_IRQHandler            [WEA
K]
  219 00000016                 EXPORT           SPI2_IRQHandler            [WEA
K]
  220 00000016                 EXPORT           USART1_IRQHandler          [WEA
K]
  221 00000016                 EXPORT           USART2_IRQHandler          [WEA
K]
  222 00000016                 EXPORT           USART3_IRQHandler          [WEA
K]
  223 00000016                 EXPORT           EXTI15_10_IRQHandler       [WEA
K]
  224 00000016                 EXPORT           RTCAlarm_IRQHandler        [WEA
K]
  225 00000016                 EXPORT           USBWakeUp_IRQHandler       [WEA
K]
  226 00000016         
  227 00000016         WWDG_IRQHandler
  228 00000016         PVD_IRQHandler
  229 00000016         TAMPER_IRQHandler
  230 00000016         RTC_IRQHandler
  231 00000016         FLASH_IRQHandler
  232 00000016         RCC_IRQHandler



ARM Macro Assembler    Page 7 


  233 00000016         EXTI0_IRQHandler
  234 00000016         EXTI1_IRQHandler
  235 00000016         EXTI2_IRQHandler
  236 00000016         EXTI3_IRQHandler
  237 00000016         EXTI4_IRQHandler
  238 00000016         DMA1_Channel1_IRQHandler
  239 00000016         DMA1_Channel2_IRQHandler
  240 00000016         DMA1_Channel3_IRQHandler
  241 00000016         DMA1_Channel4_IRQHandler
  242 00000016         DMA1_Channel5_IRQHandler
  243 00000016         DMA1_Channel6_IRQHandler
  244 00000016         DMA1_Channel7_IRQHandler
  245 00000016         ADC1_2_IRQHandler
  246 00000016         USB_HP_CAN1_TX_IRQHandler
  247 00000016         USB_LP_CAN1_RX0_IRQHandler
  248 00000016         CAN1_RX1_IRQHandler
  249 00000016         CAN1_SCE_IRQHandler
  250 00000016         EXTI9_5_IRQHandler
  251 00000016         TIM1_BRK_IRQHandler
  252 00000016         TIM1_UP_IRQHandler
  253 00000016         TIM1_TRG_COM_IRQHandler
  254 00000016         TIM1_CC_IRQHandler
  255 00000016         TIM2_IRQHandler
  256 00000016         TIM3_IRQHandler
  257 00000016         TIM4_IRQHandler
  258 00000016         I2C1_EV_IRQHandler
  259 00000016         I2C1_ER_IRQHandler
  260 00000016         I2C2_EV_IRQHandler
  261 00000016         I2C2_ER_IRQHandler
  262 00000016         SPI1_IRQHandler
  263 00000016         SPI2_IRQHandler
  264 00000016         USART1_IRQHandler
  265 00000016         USART2_IRQHandler
  266 00000016         USART3_IRQHandler
  267 00000016         EXTI15_10_IRQHandler
  268 00000016         RTCAlarm_IRQHandler
  269 00000016         USBWakeUp_IRQHandler
  270 00000016         
  271 00000016 E7FE            B                .
  272 00000018         
  273 00000018                 ENDP
  274 00000018         
  275 00000018                 ALIGN
  276 00000018         
  277 00000018         ;*******************************************************
                       ************************
  278 00000018         ; User Stack and Heap initialization
  279 00000018         ;*******************************************************
                       ************************
  280 00000018                 IF               :DEF:__MICROLIB
  287 00000018         
  288 00000018                 IMPORT           __use_two_region_memory
  289 00000018                 EXPORT           __user_initial_stackheap
  290 00000018         
  291 00000018         __user_initial_stackheap
  292 00000018         
  293 00000018 4803            LDR              R0, =  Heap_Mem
  294 0000001A 4904            LDR              R1, =(Stack_Mem + Stack_Size)
  295 0000001C 4A04            LDR              R2, = (Heap_Mem +  Heap_Size)



ARM Macro Assembler    Page 8 


  296 0000001E 4B05            LDR              R3, = Stack_Mem
  297 00000020 4770            BX               LR
  298 00000022         
  299 00000022 00 00           ALIGN
  300 00000024         
  301 00000024                 ENDIF
  302 00000024         
  303 00000024                 END
              00000000 
              00000000 
              00000400 
              00000200 
              00000000 
Command Line: --debug --xref --cpu=Cortex-M3 --apcs=interwork --depend=.\startu
p_stm32f10x_md.d -o.\startup_stm32f10x_md.o -IC:\Keil\ARM\RV31\INC -IC:\Keil\AR
M\CMSIS\Include -IC:\Keil\ARM\Inc\ST\STM32F10x --predefine="__EVAL SETA 1" --li
st=.\startup_stm32f10x_md.lst "..\..\Session 3\Lab 01\startup_stm32f10x_md.s"



ARM Macro Assembler    Page 1 Alphabetic symbol ordering
Relocatable symbols

STACK 00000000

Symbol: STACK
   Definitions
      At line 35 in file ..\..\Session
   Uses
      None
Comment: STACK unused
Stack_Mem 00000000

Symbol: Stack_Mem
   Definitions
      At line 36 in file ..\..\Session
   Uses
      At line 294 in file ..\..\Session
      At line 296 in file ..\..\Session

__initial_sp 00000400

Symbol: __initial_sp
   Definitions
      At line 37 in file ..\..\Session
   Uses
      At line 61 in file ..\..\Session
Comment: __initial_sp used once
3 symbols



ARM Macro Assembler    Page 1 Alphabetic symbol ordering
Relocatable symbols

HEAP 00000000

Symbol: HEAP
   Definitions
      At line 46 in file ..\..\Session
   Uses
      None
Comment: HEAP unused
Heap_Mem 00000000

Symbol: Heap_Mem
   Definitions
      At line 48 in file ..\..\Session
   Uses
      At line 293 in file ..\..\Session
      At line 295 in file ..\..\Session

__heap_base 00000000

Symbol: __heap_base
   Definitions
      At line 47 in file ..\..\Session
   Uses
      None
Comment: __heap_base unused
__heap_limit 00000200

Symbol: __heap_limit
   Definitions
      At line 49 in file ..\..\Session
   Uses
      None
Comment: __heap_limit unused
4 symbols



ARM Macro Assembler    Page 1 Alphabetic symbol ordering
Relocatable symbols

RESET 00000000

Symbol: RESET
   Definitions
      At line 56 in file ..\..\Session
   Uses
      None
Comment: RESET unused
__Vectors 00000000

Symbol: __Vectors
   Definitions
      At line 61 in file ..\..\Session
   Uses
      At line 57 in file ..\..\Session
      At line 124 in file ..\..\Session

__Vectors_End 000000EC

Symbol: __Vectors_End
   Definitions
      At line 122 in file ..\..\Session
   Uses
      At line 58 in file ..\..\Session
      At line 124 in file ..\..\Session

3 symbols



ARM Macro Assembler    Page 1 Alphabetic symbol ordering
Relocatable symbols

.text 00000000

Symbol: .text
   Definitions
      At line 126 in file ..\..\Session
   Uses
      None
Comment: .text unused
ADC1_2_IRQHandler 00000016

Symbol: ADC1_2_IRQHandler
   Definitions
      At line 245 in file ..\..\Session
   Uses
      At line 97 in file ..\..\Session
      At line 201 in file ..\..\Session

BusFault_Handler 0000000A

Symbol: BusFault_Handler
   Definitions
      At line 154 in file ..\..\Session
   Uses
      At line 66 in file ..\..\Session
      At line 155 in file ..\..\Session

CAN1_RX1_IRQHandler 00000016

Symbol: CAN1_RX1_IRQHandler
   Definitions
      At line 248 in file ..\..\Session
   Uses
      At line 100 in file ..\..\Session
      At line 204 in file ..\..\Session

CAN1_SCE_IRQHandler 00000016

Symbol: CAN1_SCE_IRQHandler
   Definitions
      At line 249 in file ..\..\Session
   Uses
      At line 101 in file ..\..\Session
      At line 205 in file ..\..\Session

DMA1_Channel1_IRQHandler 00000016

Symbol: DMA1_Channel1_IRQHandler
   Definitions
      At line 238 in file ..\..\Session
   Uses
      At line 90 in file ..\..\Session
      At line 194 in file ..\..\Session

DMA1_Channel2_IRQHandler 00000016

Symbol: DMA1_Channel2_IRQHandler
   Definitions
      At line 239 in file ..\..\Session
   Uses



ARM Macro Assembler    Page 2 Alphabetic symbol ordering
Relocatable symbols

      At line 91 in file ..\..\Session
      At line 195 in file ..\..\Session

DMA1_Channel3_IRQHandler 00000016

Symbol: DMA1_Channel3_IRQHandler
   Definitions
      At line 240 in file ..\..\Session
   Uses
      At line 92 in file ..\..\Session
      At line 196 in file ..\..\Session

DMA1_Channel4_IRQHandler 00000016

Symbol: DMA1_Channel4_IRQHandler
   Definitions
      At line 241 in file ..\..\Session
   Uses
      At line 93 in file ..\..\Session
      At line 197 in file ..\..\Session

DMA1_Channel5_IRQHandler 00000016

Symbol: DMA1_Channel5_IRQHandler
   Definitions
      At line 242 in file ..\..\Session
   Uses
      At line 94 in file ..\..\Session
      At line 198 in file ..\..\Session

DMA1_Channel6_IRQHandler 00000016

Symbol: DMA1_Channel6_IRQHandler
   Definitions
      At line 243 in file ..\..\Session
   Uses
      At line 95 in file ..\..\Session
      At line 199 in file ..\..\Session

DMA1_Channel7_IRQHandler 00000016

Symbol: DMA1_Channel7_IRQHandler
   Definitions
      At line 244 in file ..\..\Session
   Uses
      At line 96 in file ..\..\Session
      At line 200 in file ..\..\Session

DebugMon_Handler 00000010

Symbol: DebugMon_Handler
   Definitions
      At line 168 in file ..\..\Session
   Uses
      At line 73 in file ..\..\Session
      At line 169 in file ..\..\Session

Default_Handler 00000016




ARM Macro Assembler    Page 3 Alphabetic symbol ordering
Relocatable symbols

Symbol: Default_Handler
   Definitions
      At line 181 in file ..\..\Session
   Uses
      None
Comment: Default_Handler unused
EXTI0_IRQHandler 00000016

Symbol: EXTI0_IRQHandler
   Definitions
      At line 233 in file ..\..\Session
   Uses
      At line 85 in file ..\..\Session
      At line 189 in file ..\..\Session

EXTI15_10_IRQHandler 00000016

Symbol: EXTI15_10_IRQHandler
   Definitions
      At line 267 in file ..\..\Session
   Uses
      At line 119 in file ..\..\Session
      At line 223 in file ..\..\Session

EXTI1_IRQHandler 00000016

Symbol: EXTI1_IRQHandler
   Definitions
      At line 234 in file ..\..\Session
   Uses
      At line 86 in file ..\..\Session
      At line 190 in file ..\..\Session

EXTI2_IRQHandler 00000016

Symbol: EXTI2_IRQHandler
   Definitions
      At line 235 in file ..\..\Session
   Uses
      At line 87 in file ..\..\Session
      At line 191 in file ..\..\Session

EXTI3_IRQHandler 00000016

Symbol: EXTI3_IRQHandler
   Definitions
      At line 236 in file ..\..\Session
   Uses
      At line 88 in file ..\..\Session
      At line 192 in file ..\..\Session

EXTI4_IRQHandler 00000016

Symbol: EXTI4_IRQHandler
   Definitions
      At line 237 in file ..\..\Session
   Uses
      At line 89 in file ..\..\Session
      At line 193 in file ..\..\Session



ARM Macro Assembler    Page 4 Alphabetic symbol ordering
Relocatable symbols


EXTI9_5_IRQHandler 00000016

Symbol: EXTI9_5_IRQHandler
   Definitions
      At line 250 in file ..\..\Session
   Uses
      At line 102 in file ..\..\Session
      At line 206 in file ..\..\Session

FLASH_IRQHandler 00000016

Symbol: FLASH_IRQHandler
   Definitions
      At line 231 in file ..\..\Session
   Uses
      At line 83 in file ..\..\Session
      At line 187 in file ..\..\Session

HardFault_Handler 00000006

Symbol: HardFault_Handler
   Definitions
      At line 144 in file ..\..\Session
   Uses
      At line 64 in file ..\..\Session
      At line 145 in file ..\..\Session

I2C1_ER_IRQHandler 00000016

Symbol: I2C1_ER_IRQHandler
   Definitions
      At line 259 in file ..\..\Session
   Uses
      At line 111 in file ..\..\Session
      At line 215 in file ..\..\Session

I2C1_EV_IRQHandler 00000016

Symbol: I2C1_EV_IRQHandler
   Definitions
      At line 258 in file ..\..\Session
   Uses
      At line 110 in file ..\..\Session
      At line 214 in file ..\..\Session

I2C2_ER_IRQHandler 00000016

Symbol: I2C2_ER_IRQHandler
   Definitions
      At line 261 in file ..\..\Session
   Uses
      At line 113 in file ..\..\Session
      At line 217 in file ..\..\Session

I2C2_EV_IRQHandler 00000016

Symbol: I2C2_EV_IRQHandler
   Definitions



ARM Macro Assembler    Page 5 Alphabetic symbol ordering
Relocatable symbols

      At line 260 in file ..\..\Session
   Uses
      At line 112 in file ..\..\Session
      At line 216 in file ..\..\Session

MemManage_Handler 00000008

Symbol: MemManage_Handler
   Definitions
      At line 149 in file ..\..\Session
   Uses
      At line 65 in file ..\..\Session
      At line 150 in file ..\..\Session

NMI_Handler 00000004

Symbol: NMI_Handler
   Definitions
      At line 139 in file ..\..\Session
   Uses
      At line 63 in file ..\..\Session
      At line 140 in file ..\..\Session

PVD_IRQHandler 00000016

Symbol: PVD_IRQHandler
   Definitions
      At line 228 in file ..\..\Session
   Uses
      At line 80 in file ..\..\Session
      At line 184 in file ..\..\Session

PendSV_Handler 00000012

Symbol: PendSV_Handler
   Definitions
      At line 172 in file ..\..\Session
   Uses
      At line 75 in file ..\..\Session
      At line 173 in file ..\..\Session

RCC_IRQHandler 00000016

Symbol: RCC_IRQHandler
   Definitions
      At line 232 in file ..\..\Session
   Uses
      At line 84 in file ..\..\Session
      At line 188 in file ..\..\Session

RTCAlarm_IRQHandler 00000016

Symbol: RTCAlarm_IRQHandler
   Definitions
      At line 268 in file ..\..\Session
   Uses
      At line 120 in file ..\..\Session
      At line 224 in file ..\..\Session




ARM Macro Assembler    Page 6 Alphabetic symbol ordering
Relocatable symbols

RTC_IRQHandler 00000016

Symbol: RTC_IRQHandler
   Definitions
      At line 230 in file ..\..\Session
   Uses
      At line 82 in file ..\..\Session
      At line 186 in file ..\..\Session

Reset_Handler 00000000

Symbol: Reset_Handler
   Definitions
      At line 129 in file ..\..\Session
   Uses
      At line 62 in file ..\..\Session
      At line 130 in file ..\..\Session

SPI1_IRQHandler 00000016

Symbol: SPI1_IRQHandler
   Definitions
      At line 262 in file ..\..\Session
   Uses
      At line 114 in file ..\..\Session
      At line 218 in file ..\..\Session

SPI2_IRQHandler 00000016

Symbol: SPI2_IRQHandler
   Definitions
      At line 263 in file ..\..\Session
   Uses
      At line 115 in file ..\..\Session
      At line 219 in file ..\..\Session

SVC_Handler 0000000E

Symbol: SVC_Handler
   Definitions
      At line 163 in file ..\..\Session
   Uses
      At line 72 in file ..\..\Session
      At line 164 in file ..\..\Session

SysTick_Handler 00000014

Symbol: SysTick_Handler
   Definitions
      At line 176 in file ..\..\Session
   Uses
      At line 76 in file ..\..\Session
      At line 177 in file ..\..\Session

TAMPER_IRQHandler 00000016

Symbol: TAMPER_IRQHandler
   Definitions
      At line 229 in file ..\..\Session



ARM Macro Assembler    Page 7 Alphabetic symbol ordering
Relocatable symbols

   Uses
      At line 81 in file ..\..\Session
      At line 185 in file ..\..\Session

TIM1_BRK_IRQHandler 00000016

Symbol: TIM1_BRK_IRQHandler
   Definitions
      At line 251 in file ..\..\Session
   Uses
      At line 103 in file ..\..\Session
      At line 207 in file ..\..\Session

TIM1_CC_IRQHandler 00000016

Symbol: TIM1_CC_IRQHandler
   Definitions
      At line 254 in file ..\..\Session
   Uses
      At line 106 in file ..\..\Session
      At line 210 in file ..\..\Session

TIM1_TRG_COM_IRQHandler 00000016

Symbol: TIM1_TRG_COM_IRQHandler
   Definitions
      At line 253 in file ..\..\Session
   Uses
      At line 105 in file ..\..\Session
      At line 209 in file ..\..\Session

TIM1_UP_IRQHandler 00000016

Symbol: TIM1_UP_IRQHandler
   Definitions
      At line 252 in file ..\..\Session
   Uses
      At line 104 in file ..\..\Session
      At line 208 in file ..\..\Session

TIM2_IRQHandler 00000016

Symbol: TIM2_IRQHandler
   Definitions
      At line 255 in file ..\..\Session
   Uses
      At line 107 in file ..\..\Session
      At line 211 in file ..\..\Session

TIM3_IRQHandler 00000016

Symbol: TIM3_IRQHandler
   Definitions
      At line 256 in file ..\..\Session
   Uses
      At line 108 in file ..\..\Session
      At line 212 in file ..\..\Session

TIM4_IRQHandler 00000016



ARM Macro Assembler    Page 8 Alphabetic symbol ordering
Relocatable symbols


Symbol: TIM4_IRQHandler
   Definitions
      At line 257 in file ..\..\Session
   Uses
      At line 109 in file ..\..\Session
      At line 213 in file ..\..\Session

USART1_IRQHandler 00000016

Symbol: USART1_IRQHandler
   Definitions
      At line 264 in file ..\..\Session
   Uses
      At line 116 in file ..\..\Session
      At line 220 in file ..\..\Session

USART2_IRQHandler 00000016

Symbol: USART2_IRQHandler
   Definitions
      At line 265 in file ..\..\Session
   Uses
      At line 117 in file ..\..\Session
      At line 221 in file ..\..\Session

USART3_IRQHandler 00000016

Symbol: USART3_IRQHandler
   Definitions
      At line 266 in file ..\..\Session
   Uses
      At line 118 in file ..\..\Session
      At line 222 in file ..\..\Session

USBWakeUp_IRQHandler 00000016

Symbol: USBWakeUp_IRQHandler
   Definitions
      At line 269 in file ..\..\Session
   Uses
      At line 121 in file ..\..\Session
      At line 225 in file ..\..\Session

USB_HP_CAN1_TX_IRQHandler 00000016

Symbol: USB_HP_CAN1_TX_IRQHandler
   Definitions
      At line 246 in file ..\..\Session
   Uses
      At line 98 in file ..\..\Session
      At line 202 in file ..\..\Session

USB_LP_CAN1_RX0_IRQHandler 00000016

Symbol: USB_LP_CAN1_RX0_IRQHandler
   Definitions
      At line 247 in file ..\..\Session
   Uses



ARM Macro Assembler    Page 9 Alphabetic symbol ordering
Relocatable symbols

      At line 99 in file ..\..\Session
      At line 203 in file ..\..\Session

UsageFault_Handler 0000000C

Symbol: UsageFault_Handler
   Definitions
      At line 159 in file ..\..\Session
   Uses
      At line 67 in file ..\..\Session
      At line 160 in file ..\..\Session

WWDG_IRQHandler 00000016

Symbol: WWDG_IRQHandler
   Definitions
      At line 227 in file ..\..\Session
   Uses
      At line 79 in file ..\..\Session
      At line 183 in file ..\..\Session

__user_initial_stackheap 00000018

Symbol: __user_initial_stackheap
   Definitions
      At line 291 in file ..\..\Session
   Uses
      At line 289 in file ..\..\Session
Comment: __user_initial_stackheap used once
56 symbols



ARM Macro Assembler    Page 1 Alphabetic symbol ordering
Absolute symbols

Heap_Size 00000200

Symbol: Heap_Size
   Definitions
      At line 44 in file ..\..\Session
   Uses
      At line 48 in file ..\..\Session
      At line 295 in file ..\..\Session

Stack_Size 00000400

Symbol: Stack_Size
   Definitions
      At line 33 in file ..\..\Session
   Uses
      At line 36 in file ..\..\Session
      At line 294 in file ..\..\Session

__Vectors_Size 000000EC

Symbol: __Vectors_Size
   Definitions
      At line 124 in file ..\..\Session
   Uses
      At line 59 in file ..\..\Session
Comment: __Vectors_Size used once
3 symbols



ARM Macro Assembler    Page 1 Alphabetic symbol ordering
External symbols

__main 00000000

Symbol: __main
   Definitions
      At line 131 in file ..\..\Session
   Uses
      At line 132 in file ..\..\Session
Comment: __main used once
__use_two_region_memory 00000000

Symbol: __use_two_region_memory
   Definitions
      At line 288 in file ..\..\Session
   Uses
      None
Comment: __use_two_region_memory unused
2 symbols
406 symbols in table
