## Scan started as: "testssl.sh --logfile ../outputs/testssl-2.log --append --connect-timeout 10 --openssl-timeout 10 -t ftp localhost:21"
## at it-sec-test-vm:./bin/openssl.Linux.x86_64
## version testssl: 3.1dev 477bd13 from 2021-01-07
## version openssl: "1.0.2-chacha" from "Jan 18 17:12:17 2019")

[7m Start 2021-01-07 17:51:37        -->> 127.0.0.1:21 (localhost) <<--[m

 Further IP addresses:   ::1 
 A record via:           /etc/hosts 
 rDNS (127.0.0.1):       localhost.[0;35m Oops: TCP connect problem[m

[0;35mUnable to open a socket to 127.0.0.1:21. [m
[1;35mFatal error: Can't connect to "127.0.0.1:21"
Make sure a firewall is not between you and your scanning target![m

## Scan started as: "testssl.sh --logfile ../outputs/testssl-2.log --append --connect-timeout 10 --openssl-timeout 10 --ssl-native localhost:21"
## at it-sec-test-vm:./bin/openssl.Linux.x86_64
## version testssl: 3.1dev 477bd13 from 2021-01-07
## version openssl: "1.0.2-chacha" from "Jan 18 17:12:17 2019")

[7m Start 2021-01-07 17:51:39        -->> 127.0.0.1:21 (localhost) <<--[m

 Further IP addresses:   ::1 
 A record via:           /etc/hosts 
 rDNS (127.0.0.1):       localhost.[0;35m Oops: TCP connect problem[m

[0;35mUnable to open a socket to 127.0.0.1:21. [m
[1;35mFatal error: Can't connect to "127.0.0.1:21"
Make sure a firewall is not between you and your scanning target![m

## Scan started as: "testssl.sh --logfile ../outputs/testssl-2.log --append --connect-timeout 10 --openssl-timeout 10 -t smtp localhost:465"
## at it-sec-test-vm:./bin/openssl.Linux.x86_64
## version testssl: 3.1dev 477bd13 from 2021-01-07
## version openssl: "1.0.2-chacha" from "Jan 18 17:12:17 2019")

[7m Start 2021-01-07 17:51:42        -->> 127.0.0.1:465 (localhost) <<--[m

 Further IP addresses:   ::1 
 A record via:           /etc/hosts 
 rDNS (127.0.0.1):       localhost.[0;35m Oops: TCP connect problem[m

[0;35mUnable to open a socket to 127.0.0.1:465. [m
[1;35mFatal error: Can't connect to "127.0.0.1:465"
Make sure a firewall is not between you and your scanning target![m

## Scan started as: "testssl.sh --logfile ../outputs/testssl-2.log --append --connect-timeout 10 --openssl-timeout 10 -t smtp localhost:587"
## at it-sec-test-vm:./bin/openssl.Linux.x86_64
## version testssl: 3.1dev 477bd13 from 2021-01-07
## version openssl: "1.0.2-chacha" from "Jan 18 17:12:17 2019")

[7m Start 2021-01-07 17:51:44        -->> 127.0.0.1:587 (localhost) <<--[m

 Further IP addresses:   ::1 
 A record via:           /etc/hosts 
 rDNS (127.0.0.1):       localhost.[0;35m Oops: TCP connect problem[m

[0;35mUnable to open a socket to 127.0.0.1:587. [m
[1;35mFatal error: Can't connect to "127.0.0.1:587"
Make sure a firewall is not between you and your scanning target![m

## Scan started as: "testssl.sh --logfile ../outputs/testssl-2.log --append --connect-timeout 10 --openssl-timeout 10 --ssl-native localhost:465"
## at it-sec-test-vm:./bin/openssl.Linux.x86_64
## version testssl: 3.1dev 477bd13 from 2021-01-07
## version openssl: "1.0.2-chacha" from "Jan 18 17:12:17 2019")

[7m Start 2021-01-07 17:51:47        -->> 127.0.0.1:465 (localhost) <<--[m

 Further IP addresses:   ::1 
 A record via:           /etc/hosts 
 rDNS (127.0.0.1):       localhost.[0;35m Oops: TCP connect problem[m

[0;35mUnable to open a socket to 127.0.0.1:465. [m
[1;35mFatal error: Can't connect to "127.0.0.1:465"
Make sure a firewall is not between you and your scanning target![m

## Scan started as: "testssl.sh --logfile ../outputs/testssl-2.log --append --connect-timeout 10 --openssl-timeout 10 --ssl-native localhost:587"
## at it-sec-test-vm:./bin/openssl.Linux.x86_64
## version testssl: 3.1dev 477bd13 from 2021-01-07
## version openssl: "1.0.2-chacha" from "Jan 18 17:12:17 2019")

[7m Start 2021-01-07 17:51:49        -->> 127.0.0.1:587 (localhost) <<--[m

 Further IP addresses:   ::1 
 A record via:           /etc/hosts 
 rDNS (127.0.0.1):       localhost.[0;35m Oops: TCP connect problem[m

[0;35mUnable to open a socket to 127.0.0.1:587. [m
[1;35mFatal error: Can't connect to "127.0.0.1:587"
Make sure a firewall is not between you and your scanning target![m

## Scan started as: "testssl.sh --logfile ../outputs/testssl-2.log --append --connect-timeout 10 --openssl-timeout 10 -t pop3 localhost:110"
## at it-sec-test-vm:./bin/openssl.Linux.x86_64
## version testssl: 3.1dev 477bd13 from 2021-01-07
## version openssl: "1.0.2-chacha" from "Jan 18 17:12:17 2019")

[7m Start 2021-01-07 17:51:51        -->> 127.0.0.1:110 (localhost) <<--[m

 Further IP addresses:   ::1 
 A record via:           /etc/hosts 
 rDNS (127.0.0.1):       localhost.[0;35m Oops: TCP connect problem[m

[0;35mUnable to open a socket to 127.0.0.1:110. [m
[1;35mFatal error: Can't connect to "127.0.0.1:110"
Make sure a firewall is not between you and your scanning target![m

## Scan started as: "testssl.sh --logfile ../outputs/testssl-2.log --append --connect-timeout 10 --openssl-timeout 10 -t pop3 localhost:995"
## at it-sec-test-vm:./bin/openssl.Linux.x86_64
## version testssl: 3.1dev 477bd13 from 2021-01-07
## version openssl: "1.0.2-chacha" from "Jan 18 17:12:17 2019")

[7m Start 2021-01-07 17:51:54        -->> 127.0.0.1:995 (localhost) <<--[m

 Further IP addresses:   ::1 
 A record via:           /etc/hosts 
 rDNS (127.0.0.1):       localhost.[0;35m Oops: TCP connect problem[m

[0;35mUnable to open a socket to 127.0.0.1:995. [m
[1;35mFatal error: Can't connect to "127.0.0.1:995"
Make sure a firewall is not between you and your scanning target![m

## Scan started as: "testssl.sh --logfile ../outputs/testssl-2.log --append --connect-timeout 10 --openssl-timeout 10 --ssl-native localhost:110"
## at it-sec-test-vm:./bin/openssl.Linux.x86_64
## version testssl: 3.1dev 477bd13 from 2021-01-07
## version openssl: "1.0.2-chacha" from "Jan 18 17:12:17 2019")

[7m Start 2021-01-07 17:51:56        -->> 127.0.0.1:110 (localhost) <<--[m

 Further IP addresses:   ::1 
 A record via:           /etc/hosts 
 rDNS (127.0.0.1):       localhost.[0;35m Oops: TCP connect problem[m

[0;35mUnable to open a socket to 127.0.0.1:110. [m
[1;35mFatal error: Can't connect to "127.0.0.1:110"
Make sure a firewall is not between you and your scanning target![m

## Scan started as: "testssl.sh --logfile ../outputs/testssl-2.log --append --connect-timeout 10 --openssl-timeout 10 --ssl-native localhost:995"
## at it-sec-test-vm:./bin/openssl.Linux.x86_64
## version testssl: 3.1dev 477bd13 from 2021-01-07
## version openssl: "1.0.2-chacha" from "Jan 18 17:12:17 2019")

[7m Start 2021-01-07 17:51:58        -->> 127.0.0.1:995 (localhost) <<--[m

 Further IP addresses:   ::1 
 A record via:           /etc/hosts 
 rDNS (127.0.0.1):       localhost.[0;35m Oops: TCP connect problem[m

[0;35mUnable to open a socket to 127.0.0.1:995. [m
[1;35mFatal error: Can't connect to "127.0.0.1:995"
Make sure a firewall is not between you and your scanning target![m

## Scan started as: "testssl.sh --logfile ../outputs/testssl-2.log --append --connect-timeout 10 --openssl-timeout 10 -t imap localhost:993"
## at it-sec-test-vm:./bin/openssl.Linux.x86_64
## version testssl: 3.1dev 477bd13 from 2021-01-07
## version openssl: "1.0.2-chacha" from "Jan 18 17:12:17 2019")

[7m Start 2021-01-07 17:52:01        -->> 127.0.0.1:993 (localhost) <<--[m

 Further IP addresses:   ::1 
 A record via:           /etc/hosts 
 rDNS (127.0.0.1):       localhost.[0;35m Oops: TCP connect problem[m

[0;35mUnable to open a socket to 127.0.0.1:993. [m
[1;35mFatal error: Can't connect to "127.0.0.1:993"
Make sure a firewall is not between you and your scanning target![m

## Scan started as: "testssl.sh --logfile ../outputs/testssl-2.log --append --connect-timeout 10 --openssl-timeout 10 --ssl-native localhost:993"
## at it-sec-test-vm:./bin/openssl.Linux.x86_64
## version testssl: 3.1dev 477bd13 from 2021-01-07
## version openssl: "1.0.2-chacha" from "Jan 18 17:12:17 2019")

[7m Start 2021-01-07 17:52:03        -->> 127.0.0.1:993 (localhost) <<--[m

 Further IP addresses:   ::1 
 A record via:           /etc/hosts 
 rDNS (127.0.0.1):       localhost.[0;35m Oops: TCP connect problem[m

[0;35mUnable to open a socket to 127.0.0.1:993. [m
[1;35mFatal error: Can't connect to "127.0.0.1:993"
Make sure a firewall is not between you and your scanning target![m

## Scan started as: "testssl.sh --logfile ../outputs/testssl-2.log --append --connect-timeout 10 --openssl-timeout 10 -t postgres localhost:5432"
## at it-sec-test-vm:./bin/openssl.Linux.x86_64
## version testssl: 3.1dev 477bd13 from 2021-01-07
## version openssl: "1.0.2-chacha" from "Jan 18 17:12:17 2019")

[7m Start 2021-01-07 17:52:05        -->> 127.0.0.1:5432 (localhost) <<--[m

 Further IP addresses:   ::1 
 A record via:           /etc/hosts 
 rDNS (127.0.0.1):       localhost.[0;35m Oops: TCP connect problem[m

[0;35mUnable to open a socket to 127.0.0.1:5432. [m
[1;35mFatal error: Can't connect to "127.0.0.1:5432"
Make sure a firewall is not between you and your scanning target![m

## Scan started as: "testssl.sh --logfile ../outputs/testssl-2.log --append --connect-timeout 10 --openssl-timeout 10 --ssl-native localhost:5432"
## at it-sec-test-vm:./bin/openssl.Linux.x86_64
## version testssl: 3.1dev 477bd13 from 2021-01-07
## version openssl: "1.0.2-chacha" from "Jan 18 17:12:17 2019")

[7m Start 2021-01-07 17:52:07        -->> 127.0.0.1:5432 (localhost) <<--[m

 Further IP addresses:   ::1 
 A record via:           /etc/hosts 
 rDNS (127.0.0.1):       localhost.[0;35m Oops: TCP connect problem[m

[0;35mUnable to open a socket to 127.0.0.1:5432. [m
[1;35mFatal error: Can't connect to "127.0.0.1:5432"
Make sure a firewall is not between you and your scanning target![m

## Scan started as: "testssl.sh --logfile ../outputs/testssl-2.log --append --connect-timeout 10 --openssl-timeout 10 -t mysql localhost:3306"
## at it-sec-test-vm:./bin/openssl.Linux.x86_64
## version testssl: 3.1dev 477bd13 from 2021-01-07
## version openssl: "1.0.2-chacha" from "Jan 18 17:12:17 2019")

[7m Start 2021-01-07 17:52:09        -->> 127.0.0.1:3306 (localhost) <<--[m

 Further IP addresses:   ::1 
 A record via:           /etc/hosts 
 rDNS (127.0.0.1):       localhost.[0;35m Oops: TCP connect problem[m

[0;35mUnable to open a socket to 127.0.0.1:3306. [m
[1;35mFatal error: Can't connect to "127.0.0.1:3306"
Make sure a firewall is not between you and your scanning target![m

## Scan started as: "testssl.sh --logfile ../outputs/testssl-2.log --append --connect-timeout 10 --openssl-timeout 10 --ssl-native localhost:3306"
## at it-sec-test-vm:./bin/openssl.Linux.x86_64
## version testssl: 3.1dev 477bd13 from 2021-01-07
## version openssl: "1.0.2-chacha" from "Jan 18 17:12:17 2019")

[7m Start 2021-01-07 17:52:12        -->> 127.0.0.1:3306 (localhost) <<--[m

 Further IP addresses:   ::1 
 A record via:           /etc/hosts 
 rDNS (127.0.0.1):       localhost.[0;35m Oops: TCP connect problem[m

[0;35mUnable to open a socket to 127.0.0.1:3306. [m
[1;35mFatal error: Can't connect to "127.0.0.1:3306"
Make sure a firewall is not between you and your scanning target![m

