{
    "plugins": [],
    "recurseDepth": 10,
    "source": {
        "include":["models", "util", "routes.js", "db.js"],
        "includePattern": ".+\\.js(doc|x)?$",
        "excludePattern": "(^|\\/|\\\\)_"
    },
    "sourceType": "module",
    "tags": {
        "allowUnknownTags": true,
        "dictionaries": ["jsdoc","closure"]
    },
    "templates": {
        "cleverLinks": false,
        "monospaceLinks": false
    },
    "opts": {
      "destination": "docs",
      "recurse": true,
      "readme": "docs/README.md"
    }
}

