{
    "request": {
        "urlPattern": "/Examples/getExample",
        "method": "GET"
    },
    "response": {
        "status": 200,
        "headers": {
            "Content-Type": "application/json"
        },
        "bodyFileName": "respuestas/getExample.json"
    }
}