{
    "name": {
        "en-US": "flicked",
        "de-DE": "schnippte"
    },
    "description": {
        "en-US": "An actor dragged a draggable across the screen and let it go of further without guidence.",
        "de-DE": "Ein Akteur zog ein ziehbares Objekt über den Bildschirm und lies es in der Bewegung los was dazu führte, dass das Objekt sich weiter bewegte."
    }
}