{
    "name": {
        "de-DE": "versteht geschriebene/bebilderte Informationen (z.B. Texte, Anweisungen)"
    },
    "description": {
        "de-DE": "Subscore (5/5 bzw. ++) wenn ein Akteuer geschriebene/bebilderte Informationen (z.B. Texte, Anweisungen) versteht"
    },
    "result":{
        "score":{
          "min": 1,
          "max": 5
        }
    }
}