{
    "name": {
        "en-US": "wrote",
        "de-DE": "schrieb"
    },
    "description": {
        "en-US": "A actor put some text into a text field.",
        "de-DE": "Ein Akteur gab einen Text in ein Textfeld ein."
    }
}