%YAML 1.1
%TAG !u! tag:unity3d.com,2011:
--- !u!29 &1
OcclusionCullingSettings:
  m_ObjectHideFlags: 0
  serializedVersion: 2
  m_OcclusionBakeSettings:
    smallestOccluder: 5
    smallestHole: 0.25
    backfaceThreshold: 100
  m_SceneGUID: 00000000000000000000000000000000
  m_OcclusionCullingData: {fileID: 0}
--- !u!104 &2
RenderSettings:
  m_ObjectHideFlags: 0
  serializedVersion: 9
  m_Fog: 0
  m_FogColor: {r: 0.5, g: 0.5, b: 0.5, a: 1}
  m_FogMode: 3
  m_FogDensity: 0.01
  m_LinearFogStart: 0
  m_LinearFogEnd: 300
  m_AmbientSkyColor: {r: 0.212, g: 0.227, b: 0.259, a: 1}
  m_AmbientEquatorColor: {r: 0.114, g: 0.125, b: 0.133, a: 1}
  m_AmbientGroundColor: {r: 0.047, g: 0.043, b: 0.035, a: 1}
  m_AmbientIntensity: 1
  m_AmbientMode: 0
  m_SubtractiveShadowColor: {r: 0.42, g: 0.478, b: 0.627, a: 1}
  m_SkyboxMaterial: {fileID: 10304, guid: 0000000000000000f000000000000000, type: 0}
  m_HaloStrength: 0.5
  m_FlareStrength: 1
  m_FlareFadeSpeed: 3
  m_HaloTexture: {fileID: 0}
  m_SpotCookie: {fileID: 10001, guid: 0000000000000000e000000000000000, type: 0}
  m_DefaultReflectionMode: 0
  m_DefaultReflectionResolution: 128
  m_ReflectionBounces: 1
  m_ReflectionIntensity: 1
  m_CustomReflection: {fileID: 0}
  m_Sun: {fileID: 0}
  m_IndirectSpecularColor: {r: 0, g: 0, b: 0, a: 1}
  m_UseRadianceAmbientProbe: 0
--- !u!157 &3
LightmapSettings:
  m_ObjectHideFlags: 0
  serializedVersion: 11
  m_GIWorkflowMode: 0
  m_GISettings:
    serializedVersion: 2
    m_BounceScale: 1
    m_IndirectOutputScale: 1
    m_AlbedoBoost: 1
    m_EnvironmentLightingMode: 0
    m_EnableBakedLightmaps: 1
    m_EnableRealtimeLightmaps: 1
  m_LightmapEditorSettings:
    serializedVersion: 12
    m_Resolution: 2
    m_BakeResolution: 40
    m_AtlasSize: 1024
    m_AO: 0
    m_AOMaxDistance: 1
    m_CompAOExponent: 1
    m_CompAOExponentDirect: 0
    m_ExtractAmbientOcclusion: 0
    m_Padding: 2
    m_LightmapParameters: {fileID: 0}
    m_LightmapsBakeMode: 1
    m_TextureCompression: 1
    m_FinalGather: 0
    m_FinalGatherFiltering: 1
    m_FinalGatherRayCount: 256
    m_ReflectionCompression: 2
    m_MixedBakeMode: 2
    m_BakeBackend: 0
    m_PVRSampling: 1
    m_PVRDirectSampleCount: 32
    m_PVRSampleCount: 500
    m_PVRBounces: 2
    m_PVREnvironmentSampleCount: 500
    m_PVREnvironmentReferencePointCount: 2048
    m_PVRFilteringMode: 2
    m_PVRDenoiserTypeDirect: 0
    m_PVRDenoiserTypeIndirect: 0
    m_PVRDenoiserTypeAO: 0
    m_PVRFilterTypeDirect: 0
    m_PVRFilterTypeIndirect: 0
    m_PVRFilterTypeAO: 0
    m_PVREnvironmentMIS: 0
    m_PVRCulling: 1
    m_PVRFilteringGaussRadiusDirect: 1
    m_PVRFilteringGaussRadiusIndirect: 5
    m_PVRFilteringGaussRadiusAO: 2
    m_PVRFilteringAtrousPositionSigmaDirect: 0.5
    m_PVRFilteringAtrousPositionSigmaIndirect: 2
    m_PVRFilteringAtrousPositionSigmaAO: 1
    m_ExportTrainingData: 0
    m_TrainingDataDestination: TrainingData
    m_LightProbeSampleCountMultiplier: 4
  m_LightingDataAsset: {fileID: 0}
  m_UseShadowmask: 1
--- !u!196 &4
NavMeshSettings:
  serializedVersion: 2
  m_ObjectHideFlags: 0
  m_BuildSettings:
    serializedVersion: 2
    agentTypeID: 0
    agentRadius: 0.5
    agentHeight: 2
    agentSlope: 45
    agentClimb: 0.4
    ledgeDropHeight: 0
    maxJumpAcrossDistance: 0
    minRegionArea: 2
    manualCellSize: 0
    cellSize: 0.16666667
    manualTileSize: 0
    tileSize: 256
    accuratePlacement: 0
    debug:
      m_Flags: 0
  m_NavMeshData: {fileID: 0}
--- !u!1001 &127762375
PrefabInstance:
  m_ObjectHideFlags: 0
  serializedVersion: 2
  m_Modification:
    m_TransformParent: {fileID: 0}
    m_Modifications:
    - target: {fileID: 4343762873856180, guid: 41ae195c2ab44b94599d08ebc87752b4, type: 3}
      propertyPath: m_RootOrder
      value: 5
      objectReference: {fileID: 0}
    - target: {fileID: 4343762873856180, guid: 41ae195c2ab44b94599d08ebc87752b4, type: 3}
      propertyPath: m_LocalPosition.x
      value: -3.301
      objectReference: {fileID: 0}
    - target: {fileID: 4343762873856180, guid: 41ae195c2ab44b94599d08ebc87752b4, type: 3}
      propertyPath: m_LocalPosition.y
      value: 0.109
      objectReference: {fileID: 0}
    - target: {fileID: 4343762873856180, guid: 41ae195c2ab44b94599d08ebc87752b4, type: 3}
      propertyPath: m_LocalPosition.z
      value: 0.635
      objectReference: {fileID: 0}
    - target: {fileID: 4343762873856180, guid: 41ae195c2ab44b94599d08ebc87752b4, type: 3}
      propertyPath: m_LocalRotation.w
      value: 0.98089695
      objectReference: {fileID: 0}
    - target: {fileID: 4343762873856180, guid: 41ae195c2ab44b94599d08ebc87752b4, type: 3}
      propertyPath: m_LocalRotation.x
      value: -0
      objectReference: {fileID: 0}
    - target: {fileID: 4343762873856180, guid: 41ae195c2ab44b94599d08ebc87752b4, type: 3}
      propertyPath: m_LocalRotation.y
      value: -0.19452831
      objectReference: {fileID: 0}
    - target: {fileID: 4343762873856180, guid: 41ae195c2ab44b94599d08ebc87752b4, type: 3}
      propertyPath: m_LocalRotation.z
      value: -0
      objectReference: {fileID: 0}
    - target: {fileID: 4343762873856180, guid: 41ae195c2ab44b94599d08ebc87752b4, type: 3}
      propertyPath: m_LocalEulerAnglesHint.y
      value: -22.434002
      objectReference: {fileID: 0}
    m_RemovedComponents: []
  m_SourcePrefab: {fileID: 100100000, guid: 41ae195c2ab44b94599d08ebc87752b4, type: 3}
--- !u!1001 &183409283
PrefabInstance:
  m_ObjectHideFlags: 0
  serializedVersion: 2
  m_Modification:
    m_TransformParent: {fileID: 0}
    m_Modifications:
    - target: {fileID: 4769686723222296, guid: 75391bd72349c8a4ab85518fec8e8ef6, type: 3}
      propertyPath: m_RootOrder
      value: 28
      objectReference: {fileID: 0}
    - target: {fileID: 4769686723222296, guid: 75391bd72349c8a4ab85518fec8e8ef6, type: 3}
      propertyPath: m_LocalPosition.x
      value: -2.187
      objectReference: {fileID: 0}
    - target: {fileID: 4769686723222296, guid: 75391bd72349c8a4ab85518fec8e8ef6, type: 3}
      propertyPath: m_LocalPosition.y
      value: 0
      objectReference: {fileID: 0}
    - target: {fileID: 4769686723222296, guid: 75391bd72349c8a4ab85518fec8e8ef6, type: 3}
      propertyPath: m_LocalPosition.z
      value: -1.32
      objectReference: {fileID: 0}
    - target: {fileID: 4769686723222296, guid: 75391bd72349c8a4ab85518fec8e8ef6, type: 3}
      propertyPath: m_LocalRotation.w
      value: 0.91294867
      objectReference: {fileID: 0}
    - target: {fileID: 4769686723222296, guid: 75391bd72349c8a4ab85518fec8e8ef6, type: 3}
      propertyPath: m_LocalRotation.x
      value: 0
      objectReference: {fileID: 0}
    - target: {fileID: 4769686723222296, guid: 75391bd72349c8a4ab85518fec8e8ef6, type: 3}
      propertyPath: m_LocalRotation.y
      value: -0.4080744
      objectReference: {fileID: 0}
    - target: {fileID: 4769686723222296, guid: 75391bd72349c8a4ab85518fec8e8ef6, type: 3}
      propertyPath: m_LocalRotation.z
      value: -0
      objectReference: {fileID: 0}
    - target: {fileID: 4769686723222296, guid: 75391bd72349c8a4ab85518fec8e8ef6, type: 3}
      propertyPath: m_LocalEulerAnglesHint.y
      value: -48.168003
      objectReference: {fileID: 0}
    m_RemovedComponents: []
  m_SourcePrefab: {fileID: 100100000, guid: 75391bd72349c8a4ab85518fec8e8ef6, type: 3}
--- !u!1001 &205573739
PrefabInstance:
  m_ObjectHideFlags: 0
  serializedVersion: 2
  m_Modification:
    m_TransformParent: {fileID: 0}
    m_Modifications:
    - target: {fileID: 4414386120880746, guid: 997909fa44b7c4240a2ecb49b099d605, type: 3}
      propertyPath: m_RootOrder
      value: 4
      objectReference: {fileID: 0}
    - target: {fileID: 4414386120880746, guid: 997909fa44b7c4240a2ecb49b099d605, type: 3}
      propertyPath: m_LocalPosition.x
      value: -0.657
      objectReference: {fileID: 0}
    - target: {fileID: 4414386120880746, guid: 997909fa44b7c4240a2ecb49b099d605, type: 3}
      propertyPath: m_LocalPosition.y
      value: 0
      objectReference: {fileID: 0}
    - target: {fileID: 4414386120880746, guid: 997909fa44b7c4240a2ecb49b099d605, type: 3}
      propertyPath: m_LocalPosition.z
      value: 1.03
      objectReference: {fileID: 0}
    - target: {fileID: 4414386120880746, guid: 997909fa44b7c4240a2ecb49b099d605, type: 3}
      propertyPath: m_LocalRotation.w
      value: 1
      objectReference: {fileID: 0}
    - target: {fileID: 4414386120880746, guid: 997909fa44b7c4240a2ecb49b099d605, type: 3}
      propertyPath: m_LocalRotation.x
      value: 0
      objectReference: {fileID: 0}
    - target: {fileID: 4414386120880746, guid: 997909fa44b7c4240a2ecb49b099d605, type: 3}
      propertyPath: m_LocalRotation.y
      value: -0
      objectReference: {fileID: 0}
    - target: {fileID: 4414386120880746, guid: 997909fa44b7c4240a2ecb49b099d605, type: 3}
      propertyPath: m_LocalRotation.z
      value: -0
      objectReference: {fileID: 0}
    m_RemovedComponents: []
  m_SourcePrefab: {fileID: 100100000, guid: 997909fa44b7c4240a2ecb49b099d605, type: 3}
--- !u!1001 &226959454
PrefabInstance:
  m_ObjectHideFlags: 0
  serializedVersion: 2
  m_Modification:
    m_TransformParent: {fileID: 0}
    m_Modifications:
    - target: {fileID: 4393932566298878, guid: fe9dacf4691172643ad563458276b926, type: 3}
      propertyPath: m_RootOrder
      value: 9
      objectReference: {fileID: 0}
    - target: {fileID: 4393932566298878, guid: fe9dacf4691172643ad563458276b926, type: 3}
      propertyPath: m_LocalPosition.x
      value: -1.782
      objectReference: {fileID: 0}
    - target: {fileID: 4393932566298878, guid: fe9dacf4691172643ad563458276b926, type: 3}
      propertyPath: m_LocalPosition.y
      value: 0.028
      objectReference: {fileID: 0}
    - target: {fileID: 4393932566298878, guid: fe9dacf4691172643ad563458276b926, type: 3}
      propertyPath: m_LocalPosition.z
      value: 1.259
      objectReference: {fileID: 0}
    - target: {fileID: 4393932566298878, guid: fe9dacf4691172643ad563458276b926, type: 3}
      propertyPath: m_LocalRotation.w
      value: 0.5000001
      objectReference: {fileID: 0}
    - target: {fileID: 4393932566298878, guid: fe9dacf4691172643ad563458276b926, type: 3}
      propertyPath: m_LocalRotation.x
      value: -0.49999997
      objectReference: {fileID: 0}
    - target: {fileID: 4393932566298878, guid: fe9dacf4691172643ad563458276b926, type: 3}
      propertyPath: m_LocalRotation.y
      value: -0.49999997
      objectReference: {fileID: 0}
    - target: {fileID: 4393932566298878, guid: fe9dacf4691172643ad563458276b926, type: 3}
      propertyPath: m_LocalRotation.z
      value: 0.50000006
      objectReference: {fileID: 0}
    - target: {fileID: 4393932566298878, guid: fe9dacf4691172643ad563458276b926, type: 3}
      propertyPath: m_LocalEulerAnglesHint.y
      value: -90.00001
      objectReference: {fileID: 0}
    - target: {fileID: 4393932566298878, guid: fe9dacf4691172643ad563458276b926, type: 3}
      propertyPath: m_LocalEulerAnglesHint.z
      value: 90.00001
      objectReference: {fileID: 0}
    m_RemovedComponents: []
  m_SourcePrefab: {fileID: 100100000, guid: fe9dacf4691172643ad563458276b926, type: 3}
--- !u!1001 &248608562
PrefabInstance:
  m_ObjectHideFlags: 0
  serializedVersion: 2
  m_Modification:
    m_TransformParent: {fileID: 0}
    m_Modifications:
    - target: {fileID: 4090930248418578, guid: ac776ec65a1cd5d438e6afb69508c3b7, type: 3}
      propertyPath: m_RootOrder
      value: 20
      objectReference: {fileID: 0}
    - target: {fileID: 4090930248418578, guid: ac776ec65a1cd5d438e6afb69508c3b7, type: 3}
      propertyPath: m_LocalPosition.x
      value: -0.793
      objectReference: {fileID: 0}
    - target: {fileID: 4090930248418578, guid: ac776ec65a1cd5d438e6afb69508c3b7, type: 3}
      propertyPath: m_LocalPosition.y
      value: 0
      objectReference: {fileID: 0}
    - target: {fileID: 4090930248418578, guid: ac776ec65a1cd5d438e6afb69508c3b7, type: 3}
      propertyPath: m_LocalPosition.z
      value: 0.491
      objectReference: {fileID: 0}
    - target: {fileID: 4090930248418578, guid: ac776ec65a1cd5d438e6afb69508c3b7, type: 3}
      propertyPath: m_LocalRotation.w
      value: 0.89708644
      objectReference: {fileID: 0}
    - target: {fileID: 4090930248418578, guid: ac776ec65a1cd5d438e6afb69508c3b7, type: 3}
      propertyPath: m_LocalRotation.x
      value: -0.05415014
      objectReference: {fileID: 0}
    - target: {fileID: 4090930248418578, guid: ac776ec65a1cd5d438e6afb69508c3b7, type: 3}
      propertyPath: m_LocalRotation.y
      value: -0.43537202
      objectReference: {fileID: 0}
    - target: {fileID: 4090930248418578, guid: ac776ec65a1cd5d438e6afb69508c3b7, type: 3}
      propertyPath: m_LocalRotation.z
      value: 0.052488223
      objectReference: {fileID: 0}
    - target: {fileID: 4090930248418578, guid: ac776ec65a1cd5d438e6afb69508c3b7, type: 3}
      propertyPath: m_LocalEulerAnglesHint.x
      value: -2.9490001
      objectReference: {fileID: 0}
    - target: {fileID: 4090930248418578, guid: ac776ec65a1cd5d438e6afb69508c3b7, type: 3}
      propertyPath: m_LocalEulerAnglesHint.y
      value: -51.986004
      objectReference: {fileID: 0}
    - target: {fileID: 4090930248418578, guid: ac776ec65a1cd5d438e6afb69508c3b7, type: 3}
      propertyPath: m_LocalEulerAnglesHint.z
      value: 8.135
      objectReference: {fileID: 0}
    m_RemovedComponents: []
  m_SourcePrefab: {fileID: 100100000, guid: ac776ec65a1cd5d438e6afb69508c3b7, type: 3}
--- !u!1 &358899078
GameObject:
  m_ObjectHideFlags: 0
  m_CorrespondingSourceObject: {fileID: 0}
  m_PrefabInstance: {fileID: 0}
  m_PrefabAsset: {fileID: 0}
  serializedVersion: 6
  m_Component:
  - component: {fileID: 358899084}
  - component: {fileID: 358899083}
  - component: {fileID: 358899081}
  - component: {fileID: 358899080}
  m_Layer: 0
  m_Name: Main Camera
  m_TagString: MainCamera
  m_Icon: {fileID: 0}
  m_NavMeshLayer: 0
  m_StaticEditorFlags: 0
  m_IsActive: 1
--- !u!81 &358899080
AudioListener:
  m_ObjectHideFlags: 0
  m_CorrespondingSourceObject: {fileID: 0}
  m_PrefabInstance: {fileID: 0}
  m_PrefabAsset: {fileID: 0}
  m_GameObject: {fileID: 358899078}
  m_Enabled: 1
--- !u!124 &358899081
Behaviour:
  m_ObjectHideFlags: 0
  m_CorrespondingSourceObject: {fileID: 0}
  m_PrefabInstance: {fileID: 0}
  m_PrefabAsset: {fileID: 0}
  m_GameObject: {fileID: 358899078}
  m_Enabled: 1
--- !u!20 &358899083
Camera:
  m_ObjectHideFlags: 0
  m_CorrespondingSourceObject: {fileID: 0}
  m_PrefabInstance: {fileID: 0}
  m_PrefabAsset: {fileID: 0}
  m_GameObject: {fileID: 358899078}
  m_Enabled: 1
  serializedVersion: 2
  m_ClearFlags: 1
  m_BackGroundColor: {r: 0.19215687, g: 0.3019608, b: 0.4745098, a: 0}
  m_projectionMatrixMode: 1
  m_GateFitMode: 2
  m_FOVAxisMode: 0
  m_SensorSize: {x: 36, y: 24}
  m_LensShift: {x: 0, y: 0}
  m_FocalLength: 50
  m_NormalizedViewPortRect:
    serializedVersion: 2
    x: 0
    y: 0
    width: 1
    height: 1
  near clip plane: 0.3
  far clip plane: 1000
  field of view: 36.2
  orthographic: 0
  orthographic size: 5
  m_Depth: -1
  m_CullingMask:
    serializedVersion: 2
    m_Bits: 4294967295
  m_RenderingPath: -1
  m_TargetTexture: {fileID: 0}
  m_TargetDisplay: 0
  m_TargetEye: 3
  m_HDR: 1
  m_AllowMSAA: 1
  m_AllowDynamicResolution: 0
  m_ForceIntoRT: 0
  m_OcclusionCulling: 1
  m_StereoConvergence: 10
  m_StereoSeparation: 0.022
--- !u!4 &358899084
Transform:
  m_ObjectHideFlags: 0
  m_CorrespondingSourceObject: {fileID: 0}
  m_PrefabInstance: {fileID: 0}
  m_PrefabAsset: {fileID: 0}
  m_GameObject: {fileID: 358899078}
  m_LocalRotation: {x: 0.005026091, y: 0.97087175, z: -0.23916516, w: 0.013524252}
  m_LocalPosition: {x: -1.577608, y: 2.89, z: 4.496093}
  m_LocalScale: {x: 1, y: 1, z: 1}
  m_Children: []
  m_Father: {fileID: 0}
  m_RootOrder: 0
  m_LocalEulerAnglesHint: {x: 27.680002, y: 178.45601, z: 0.21300001}
--- !u!1001 &460851703
PrefabInstance:
  m_ObjectHideFlags: 0
  serializedVersion: 2
  m_Modification:
    m_TransformParent: {fileID: 0}
    m_Modifications:
    - target: {fileID: 4780426884575216, guid: 096ea40a5c7a73342bac52f5679832b2, type: 3}
      propertyPath: m_RootOrder
      value: 12
      objectReference: {fileID: 0}
    - target: {fileID: 4780426884575216, guid: 096ea40a5c7a73342bac52f5679832b2, type: 3}
      propertyPath: m_LocalPosition.x
      value: -2.015
      objectReference: {fileID: 0}
    - target: {fileID: 4780426884575216, guid: 096ea40a5c7a73342bac52f5679832b2, type: 3}
      propertyPath: m_LocalPosition.y
      value: 0.016
      objectReference: {fileID: 0}
    - target: {fileID: 4780426884575216, guid: 096ea40a5c7a73342bac52f5679832b2, type: 3}
      propertyPath: m_LocalPosition.z
      value: 1.404
      objectReference: {fileID: 0}
    - target: {fileID: 4780426884575216, guid: 096ea40a5c7a73342bac52f5679832b2, type: 3}
      propertyPath: m_LocalRotation.w
      value: -0.49999988
      objectReference: {fileID: 0}
    - target: {fileID: 4780426884575216, guid: 096ea40a5c7a73342bac52f5679832b2, type: 3}
      propertyPath: m_LocalRotation.x
      value: 0.5000001
      objectReference: {fileID: 0}
    - target: {fileID: 4780426884575216, guid: 096ea40a5c7a73342bac52f5679832b2, type: 3}
      propertyPath: m_LocalRotation.y
      value: -0.50000006
      objectReference: {fileID: 0}
    - target: {fileID: 4780426884575216, guid: 096ea40a5c7a73342bac52f5679832b2, type: 3}
      propertyPath: m_LocalRotation.z
      value: 0.5
      objectReference: {fileID: 0}
    - target: {fileID: 4780426884575216, guid: 096ea40a5c7a73342bac52f5679832b2, type: 3}
      propertyPath: m_LocalEulerAnglesHint.x
      value: 180
      objectReference: {fileID: 0}
    - target: {fileID: 4780426884575216, guid: 096ea40a5c7a73342bac52f5679832b2, type: 3}
      propertyPath: m_LocalEulerAnglesHint.y
      value: -90
      objectReference: {fileID: 0}
    - target: {fileID: 4780426884575216, guid: 096ea40a5c7a73342bac52f5679832b2, type: 3}
      propertyPath: m_LocalEulerAnglesHint.z
      value: 89.99999
      objectReference: {fileID: 0}
    m_RemovedComponents: []
  m_SourcePrefab: {fileID: 100100000, guid: 096ea40a5c7a73342bac52f5679832b2, type: 3}
--- !u!1001 &672969398
PrefabInstance:
  m_ObjectHideFlags: 0
  serializedVersion: 2
  m_Modification:
    m_TransformParent: {fileID: 0}
    m_Modifications:
    - target: {fileID: 4009738264748936, guid: 9fe178956af0d4a419bfcb4bb5572201, type: 3}
      propertyPath: m_RootOrder
      value: 2
      objectReference: {fileID: 0}
    - target: {fileID: 4009738264748936, guid: 9fe178956af0d4a419bfcb4bb5572201, type: 3}
      propertyPath: m_LocalPosition.x
      value: 0.125
      objectReference: {fileID: 0}
    - target: {fileID: 4009738264748936, guid: 9fe178956af0d4a419bfcb4bb5572201, type: 3}
      propertyPath: m_LocalPosition.y
      value: -0.014
      objectReference: {fileID: 0}
    - target: {fileID: 4009738264748936, guid: 9fe178956af0d4a419bfcb4bb5572201, type: 3}
      propertyPath: m_LocalPosition.z
      value: 0.152
      objectReference: {fileID: 0}
    - target: {fileID: 4009738264748936, guid: 9fe178956af0d4a419bfcb4bb5572201, type: 3}
      propertyPath: m_LocalRotation.w
      value: 0.95049185
      objectReference: {fileID: 0}
    - target: {fileID: 4009738264748936, guid: 9fe178956af0d4a419bfcb4bb5572201, type: 3}
      propertyPath: m_LocalRotation.x
      value: -0.039812196
      objectReference: {fileID: 0}
    - target: {fileID: 4009738264748936, guid: 9fe178956af0d4a419bfcb4bb5572201, type: 3}
      propertyPath: m_LocalRotation.y
      value: -0.3078122
      objectReference: {fileID: 0}
    - target: {fileID: 4009738264748936, guid: 9fe178956af0d4a419bfcb4bb5572201, type: 3}
      propertyPath: m_LocalRotation.z
      value: -0.015226494
      objectReference: {fileID: 0}
    - target: {fileID: 4009738264748936, guid: 9fe178956af0d4a419bfcb4bb5572201, type: 3}
      propertyPath: m_LocalEulerAnglesHint.x
      value: -4.879
      objectReference: {fileID: 0}
    - target: {fileID: 4009738264748936, guid: 9fe178956af0d4a419bfcb4bb5572201, type: 3}
      propertyPath: m_LocalEulerAnglesHint.y
      value: -35.878002
      objectReference: {fileID: 0}
    - target: {fileID: 4009738264748936, guid: 9fe178956af0d4a419bfcb4bb5572201, type: 3}
      propertyPath: m_LocalEulerAnglesHint.z
      value: -0.25500003
      objectReference: {fileID: 0}
    - target: {fileID: 95566444143309992, guid: 9fe178956af0d4a419bfcb4bb5572201,
        type: 3}
      propertyPath: m_Enabled
      value: 1
      objectReference: {fileID: 0}
    - target: {fileID: 95566444143309992, guid: 9fe178956af0d4a419bfcb4bb5572201,
        type: 3}
      propertyPath: m_Controller
      value: 
      objectReference: {fileID: 9100000, guid: 4b7d7b370a4c10f46a4d07e11ce4fc06, type: 2}
    m_RemovedComponents:
    - {fileID: 95566444143309992, guid: 9fe178956af0d4a419bfcb4bb5572201, type: 3}
  m_SourcePrefab: {fileID: 100100000, guid: 9fe178956af0d4a419bfcb4bb5572201, type: 3}
--- !u!1001 &795613664
PrefabInstance:
  m_ObjectHideFlags: 0
  serializedVersion: 2
  m_Modification:
    m_TransformParent: {fileID: 0}
    m_Modifications:
    - target: {fileID: 4733429740860840, guid: 9e0a4ec04f4800b47831c413f2083fcb, type: 3}
      propertyPath: m_RootOrder
      value: 22
      objectReference: {fileID: 0}
    - target: {fileID: 4733429740860840, guid: 9e0a4ec04f4800b47831c413f2083fcb, type: 3}
      propertyPath: m_LocalScale.x
      value: 1.531231
      objectReference: {fileID: 0}
    - target: {fileID: 4733429740860840, guid: 9e0a4ec04f4800b47831c413f2083fcb, type: 3}
      propertyPath: m_LocalScale.y
      value: 1.5312309
      objectReference: {fileID: 0}
    - target: {fileID: 4733429740860840, guid: 9e0a4ec04f4800b47831c413f2083fcb, type: 3}
      propertyPath: m_LocalScale.z
      value: 1.5312309
      objectReference: {fileID: 0}
    - target: {fileID: 4733429740860840, guid: 9e0a4ec04f4800b47831c413f2083fcb, type: 3}
      propertyPath: m_LocalPosition.x
      value: -1.159
      objectReference: {fileID: 0}
    - target: {fileID: 4733429740860840, guid: 9e0a4ec04f4800b47831c413f2083fcb, type: 3}
      propertyPath: m_LocalPosition.y
      value: -0.018
      objectReference: {fileID: 0}
    - target: {fileID: 4733429740860840, guid: 9e0a4ec04f4800b47831c413f2083fcb, type: 3}
      propertyPath: m_LocalPosition.z
      value: 0.575
      objectReference: {fileID: 0}
    - target: {fileID: 4733429740860840, guid: 9e0a4ec04f4800b47831c413f2083fcb, type: 3}
      propertyPath: m_LocalRotation.w
      value: 0.7002986
      objectReference: {fileID: 0}
    - target: {fileID: 4733429740860840, guid: 9e0a4ec04f4800b47831c413f2083fcb, type: 3}
      propertyPath: m_LocalRotation.x
      value: -0.7002991
      objectReference: {fileID: 0}
    - target: {fileID: 4733429740860840, guid: 9e0a4ec04f4800b47831c413f2083fcb, type: 3}
      propertyPath: m_LocalRotation.y
      value: 0.0978852
      objectReference: {fileID: 0}
    - target: {fileID: 4733429740860840, guid: 9e0a4ec04f4800b47831c413f2083fcb, type: 3}
      propertyPath: m_LocalRotation.z
      value: 0.097885095
      objectReference: {fileID: 0}
    - target: {fileID: 4733429740860840, guid: 9e0a4ec04f4800b47831c413f2083fcb, type: 3}
      propertyPath: m_LocalEulerAnglesHint.x
      value: -89.98
      objectReference: {fileID: 0}
    - target: {fileID: 4733429740860840, guid: 9e0a4ec04f4800b47831c413f2083fcb, type: 3}
      propertyPath: m_LocalEulerAnglesHint.z
      value: 15.9140005
      objectReference: {fileID: 0}
    m_RemovedComponents: []
  m_SourcePrefab: {fileID: 100100000, guid: 9e0a4ec04f4800b47831c413f2083fcb, type: 3}
--- !u!1001 &866921532
PrefabInstance:
  m_ObjectHideFlags: 0
  serializedVersion: 2
  m_Modification:
    m_TransformParent: {fileID: 0}
    m_Modifications:
    - target: {fileID: 4816141742237230, guid: 14f4cf197a1fca34b8737c705c6ecfc1, type: 3}
      propertyPath: m_RootOrder
      value: 6
      objectReference: {fileID: 0}
    - target: {fileID: 4816141742237230, guid: 14f4cf197a1fca34b8737c705c6ecfc1, type: 3}
      propertyPath: m_LocalPosition.x
      value: -1.009
      objectReference: {fileID: 0}
    - target: {fileID: 4816141742237230, guid: 14f4cf197a1fca34b8737c705c6ecfc1, type: 3}
      propertyPath: m_LocalPosition.y
      value: 0.066
      objectReference: {fileID: 0}
    - target: {fileID: 4816141742237230, guid: 14f4cf197a1fca34b8737c705c6ecfc1, type: 3}
      propertyPath: m_LocalPosition.z
      value: 1.031
      objectReference: {fileID: 0}
    - target: {fileID: 4816141742237230, guid: 14f4cf197a1fca34b8737c705c6ecfc1, type: 3}
      propertyPath: m_LocalRotation.w
      value: 1
      objectReference: {fileID: 0}
    - target: {fileID: 4816141742237230, guid: 14f4cf197a1fca34b8737c705c6ecfc1, type: 3}
      propertyPath: m_LocalRotation.x
      value: 0
      objectReference: {fileID: 0}
    - target: {fileID: 4816141742237230, guid: 14f4cf197a1fca34b8737c705c6ecfc1, type: 3}
      propertyPath: m_LocalRotation.y
      value: -0
      objectReference: {fileID: 0}
    - target: {fileID: 4816141742237230, guid: 14f4cf197a1fca34b8737c705c6ecfc1, type: 3}
      propertyPath: m_LocalRotation.z
      value: -0
      objectReference: {fileID: 0}
    m_RemovedComponents: []
  m_SourcePrefab: {fileID: 100100000, guid: 14f4cf197a1fca34b8737c705c6ecfc1, type: 3}
--- !u!1001 &923799926
PrefabInstance:
  m_ObjectHideFlags: 0
  serializedVersion: 2
  m_Modification:
    m_TransformParent: {fileID: 0}
    m_Modifications:
    - target: {fileID: 4985778594100514, guid: 49ca4dd25f534bf4b9e1aed8500990ac, type: 3}
      propertyPath: m_RootOrder
      value: 18
      objectReference: {fileID: 0}
    - target: {fileID: 4985778594100514, guid: 49ca4dd25f534bf4b9e1aed8500990ac, type: 3}
      propertyPath: m_LocalPosition.x
      value: -2.63
      objectReference: {fileID: 0}
    - target: {fileID: 4985778594100514, guid: 49ca4dd25f534bf4b9e1aed8500990ac, type: 3}
      propertyPath: m_LocalPosition.y
      value: 0.28
      objectReference: {fileID: 0}
    - target: {fileID: 4985778594100514, guid: 49ca4dd25f534bf4b9e1aed8500990ac, type: 3}
      propertyPath: m_LocalPosition.z
      value: 0.832
      objectReference: {fileID: 0}
    - target: {fileID: 4985778594100514, guid: 49ca4dd25f534bf4b9e1aed8500990ac, type: 3}
      propertyPath: m_LocalRotation.w
      value: 0.15044412
      objectReference: {fileID: 0}
    - target: {fileID: 4985778594100514, guid: 49ca4dd25f534bf4b9e1aed8500990ac, type: 3}
      propertyPath: m_LocalRotation.x
      value: 0.027241116
      objectReference: {fileID: 0}
    - target: {fileID: 4985778594100514, guid: 49ca4dd25f534bf4b9e1aed8500990ac, type: 3}
      propertyPath: m_LocalRotation.y
      value: 0.9877976
      objectReference: {fileID: 0}
    - target: {fileID: 4985778594100514, guid: 49ca4dd25f534bf4b9e1aed8500990ac, type: 3}
      propertyPath: m_LocalRotation.z
      value: -0.029671658
      objectReference: {fileID: 0}
    - target: {fileID: 4985778594100514, guid: 49ca4dd25f534bf4b9e1aed8500990ac, type: 3}
      propertyPath: m_LocalEulerAnglesHint.x
      value: 3.831
      objectReference: {fileID: 0}
    - target: {fileID: 4985778594100514, guid: 49ca4dd25f534bf4b9e1aed8500990ac, type: 3}
      propertyPath: m_LocalEulerAnglesHint.y
      value: 162.76701
      objectReference: {fileID: 0}
    - target: {fileID: 4985778594100514, guid: 49ca4dd25f534bf4b9e1aed8500990ac, type: 3}
      propertyPath: m_LocalEulerAnglesHint.z
      value: 2.5790002
      objectReference: {fileID: 0}
    m_RemovedComponents: []
  m_SourcePrefab: {fileID: 100100000, guid: 49ca4dd25f534bf4b9e1aed8500990ac, type: 3}
--- !u!1001 &1173553485
PrefabInstance:
  m_ObjectHideFlags: 0
  serializedVersion: 2
  m_Modification:
    m_TransformParent: {fileID: 0}
    m_Modifications:
    - target: {fileID: 4830817784829162, guid: c2a884191c0e3a5448feb8a016553ad0, type: 3}
      propertyPath: m_RootOrder
      value: 15
      objectReference: {fileID: 0}
    - target: {fileID: 4830817784829162, guid: c2a884191c0e3a5448feb8a016553ad0, type: 3}
      propertyPath: m_LocalScale.x
      value: 0.84585786
      objectReference: {fileID: 0}
    - target: {fileID: 4830817784829162, guid: c2a884191c0e3a5448feb8a016553ad0, type: 3}
      propertyPath: m_LocalScale.y
      value: 0.84585786
      objectReference: {fileID: 0}
    - target: {fileID: 4830817784829162, guid: c2a884191c0e3a5448feb8a016553ad0, type: 3}
      propertyPath: m_LocalScale.z
      value: 0.84585786
      objectReference: {fileID: 0}
    - target: {fileID: 4830817784829162, guid: c2a884191c0e3a5448feb8a016553ad0, type: 3}
      propertyPath: m_LocalPosition.x
      value: -1.253
      objectReference: {fileID: 0}
    - target: {fileID: 4830817784829162, guid: c2a884191c0e3a5448feb8a016553ad0, type: 3}
      propertyPath: m_LocalPosition.y
      value: 0
      objectReference: {fileID: 0}
    - target: {fileID: 4830817784829162, guid: c2a884191c0e3a5448feb8a016553ad0, type: 3}
      propertyPath: m_LocalPosition.z
      value: -0.121
      objectReference: {fileID: 0}
    - target: {fileID: 4830817784829162, guid: c2a884191c0e3a5448feb8a016553ad0, type: 3}
      propertyPath: m_LocalRotation.w
      value: 0.9943292
      objectReference: {fileID: 0}
    - target: {fileID: 4830817784829162, guid: c2a884191c0e3a5448feb8a016553ad0, type: 3}
      propertyPath: m_LocalRotation.x
      value: -0
      objectReference: {fileID: 0}
    - target: {fileID: 4830817784829162, guid: c2a884191c0e3a5448feb8a016553ad0, type: 3}
      propertyPath: m_LocalRotation.y
      value: -0.10634604
      objectReference: {fileID: 0}
    - target: {fileID: 4830817784829162, guid: c2a884191c0e3a5448feb8a016553ad0, type: 3}
      propertyPath: m_LocalRotation.z
      value: -0
      objectReference: {fileID: 0}
    - target: {fileID: 4830817784829162, guid: c2a884191c0e3a5448feb8a016553ad0, type: 3}
      propertyPath: m_LocalEulerAnglesHint.y
      value: -12.209001
      objectReference: {fileID: 0}
    - target: {fileID: 23177018041359224, guid: c2a884191c0e3a5448feb8a016553ad0,
        type: 3}
      propertyPath: m_Materials.Array.data[0]
      value: 
      objectReference: {fileID: 2100000, guid: 986f05caa7faa654a896eefcec8dc17e, type: 2}
    m_RemovedComponents: []
  m_SourcePrefab: {fileID: 100100000, guid: c2a884191c0e3a5448feb8a016553ad0, type: 3}
--- !u!1001 &1188858556
PrefabInstance:
  m_ObjectHideFlags: 0
  serializedVersion: 2
  m_Modification:
    m_TransformParent: {fileID: 0}
    m_Modifications:
    - target: {fileID: 4750466346983816, guid: 734f81580a44b3d4b8c820a092d9f247, type: 3}
      propertyPath: m_RootOrder
      value: 11
      objectReference: {fileID: 0}
    - target: {fileID: 4750466346983816, guid: 734f81580a44b3d4b8c820a092d9f247, type: 3}
      propertyPath: m_LocalPosition.x
      value: -2.015
      objectReference: {fileID: 0}
    - target: {fileID: 4750466346983816, guid: 734f81580a44b3d4b8c820a092d9f247, type: 3}
      propertyPath: m_LocalPosition.y
      value: 0.016
      objectReference: {fileID: 0}
    - target: {fileID: 4750466346983816, guid: 734f81580a44b3d4b8c820a092d9f247, type: 3}
      propertyPath: m_LocalPosition.z
      value: 1.404
      objectReference: {fileID: 0}
    - target: {fileID: 4750466346983816, guid: 734f81580a44b3d4b8c820a092d9f247, type: 3}
      propertyPath: m_LocalRotation.w
      value: -0.49999988
      objectReference: {fileID: 0}
    - target: {fileID: 4750466346983816, guid: 734f81580a44b3d4b8c820a092d9f247, type: 3}
      propertyPath: m_LocalRotation.x
      value: 0.5000001
      objectReference: {fileID: 0}
    - target: {fileID: 4750466346983816, guid: 734f81580a44b3d4b8c820a092d9f247, type: 3}
      propertyPath: m_LocalRotation.y
      value: -0.50000006
      objectReference: {fileID: 0}
    - target: {fileID: 4750466346983816, guid: 734f81580a44b3d4b8c820a092d9f247, type: 3}
      propertyPath: m_LocalRotation.z
      value: 0.5
      objectReference: {fileID: 0}
    - target: {fileID: 4750466346983816, guid: 734f81580a44b3d4b8c820a092d9f247, type: 3}
      propertyPath: m_LocalEulerAnglesHint.x
      value: 180
      objectReference: {fileID: 0}
    - target: {fileID: 4750466346983816, guid: 734f81580a44b3d4b8c820a092d9f247, type: 3}
      propertyPath: m_LocalEulerAnglesHint.y
      value: -90
      objectReference: {fileID: 0}
    - target: {fileID: 4750466346983816, guid: 734f81580a44b3d4b8c820a092d9f247, type: 3}
      propertyPath: m_LocalEulerAnglesHint.z
      value: 89.99999
      objectReference: {fileID: 0}
    m_RemovedComponents: []
  m_SourcePrefab: {fileID: 100100000, guid: 734f81580a44b3d4b8c820a092d9f247, type: 3}
--- !u!1001 &1301370688
PrefabInstance:
  m_ObjectHideFlags: 0
  serializedVersion: 2
  m_Modification:
    m_TransformParent: {fileID: 0}
    m_Modifications:
    - target: {fileID: 4637691644306650, guid: cd90571575f82ac46bed967ba562eb20, type: 3}
      propertyPath: m_RootOrder
      value: 10
      objectReference: {fileID: 0}
    - target: {fileID: 4637691644306650, guid: cd90571575f82ac46bed967ba562eb20, type: 3}
      propertyPath: m_LocalPosition.x
      value: -1.789
      objectReference: {fileID: 0}
    - target: {fileID: 4637691644306650, guid: cd90571575f82ac46bed967ba562eb20, type: 3}
      propertyPath: m_LocalPosition.y
      value: 0
      objectReference: {fileID: 0}
    - target: {fileID: 4637691644306650, guid: cd90571575f82ac46bed967ba562eb20, type: 3}
      propertyPath: m_LocalPosition.z
      value: 0.412
      objectReference: {fileID: 0}
    - target: {fileID: 4637691644306650, guid: cd90571575f82ac46bed967ba562eb20, type: 3}
      propertyPath: m_LocalRotation.w
      value: 1
      objectReference: {fileID: 0}
    - target: {fileID: 4637691644306650, guid: cd90571575f82ac46bed967ba562eb20, type: 3}
      propertyPath: m_LocalRotation.x
      value: 0
      objectReference: {fileID: 0}
    - target: {fileID: 4637691644306650, guid: cd90571575f82ac46bed967ba562eb20, type: 3}
      propertyPath: m_LocalRotation.y
      value: -0
      objectReference: {fileID: 0}
    - target: {fileID: 4637691644306650, guid: cd90571575f82ac46bed967ba562eb20, type: 3}
      propertyPath: m_LocalRotation.z
      value: -0
      objectReference: {fileID: 0}
    m_RemovedComponents: []
  m_SourcePrefab: {fileID: 100100000, guid: cd90571575f82ac46bed967ba562eb20, type: 3}
--- !u!1001 &1346854097
PrefabInstance:
  m_ObjectHideFlags: 0
  serializedVersion: 2
  m_Modification:
    m_TransformParent: {fileID: 0}
    m_Modifications:
    - target: {fileID: 4466428158358784, guid: 5befafd5e75d02b4291651237d35a5e4, type: 3}
      propertyPath: m_RootOrder
      value: 21
      objectReference: {fileID: 0}
    - target: {fileID: 4466428158358784, guid: 5befafd5e75d02b4291651237d35a5e4, type: 3}
      propertyPath: m_LocalPosition.x
      value: 0.227
      objectReference: {fileID: 0}
    - target: {fileID: 4466428158358784, guid: 5befafd5e75d02b4291651237d35a5e4, type: 3}
      propertyPath: m_LocalPosition.y
      value: -0.041
      objectReference: {fileID: 0}
    - target: {fileID: 4466428158358784, guid: 5befafd5e75d02b4291651237d35a5e4, type: 3}
      propertyPath: m_LocalPosition.z
      value: 0.712
      objectReference: {fileID: 0}
    - target: {fileID: 4466428158358784, guid: 5befafd5e75d02b4291651237d35a5e4, type: 3}
      propertyPath: m_LocalRotation.w
      value: 0.95922387
      objectReference: {fileID: 0}
    - target: {fileID: 4466428158358784, guid: 5befafd5e75d02b4291651237d35a5e4, type: 3}
      propertyPath: m_LocalRotation.x
      value: -0.054372992
      objectReference: {fileID: 0}
    - target: {fileID: 4466428158358784, guid: 5befafd5e75d02b4291651237d35a5e4, type: 3}
      propertyPath: m_LocalRotation.y
      value: -0.27186024
      objectReference: {fileID: 0}
    - target: {fileID: 4466428158358784, guid: 5befafd5e75d02b4291651237d35a5e4, type: 3}
      propertyPath: m_LocalRotation.z
      value: 0.05500257
      objectReference: {fileID: 0}
    - target: {fileID: 4466428158358784, guid: 5befafd5e75d02b4291651237d35a5e4, type: 3}
      propertyPath: m_LocalEulerAnglesHint.x
      value: -4.267
      objectReference: {fileID: 0}
    - target: {fileID: 4466428158358784, guid: 5befafd5e75d02b4291651237d35a5e4, type: 3}
      propertyPath: m_LocalEulerAnglesHint.y
      value: -31.938002
      objectReference: {fileID: 0}
    - target: {fileID: 4466428158358784, guid: 5befafd5e75d02b4291651237d35a5e4, type: 3}
      propertyPath: m_LocalEulerAnglesHint.z
      value: 7.7850003
      objectReference: {fileID: 0}
    m_RemovedComponents: []
  m_SourcePrefab: {fileID: 100100000, guid: 5befafd5e75d02b4291651237d35a5e4, type: 3}
--- !u!1 &1439336916
GameObject:
  m_ObjectHideFlags: 0
  m_CorrespondingSourceObject: {fileID: 0}
  m_PrefabInstance: {fileID: 0}
  m_PrefabAsset: {fileID: 0}
  serializedVersion: 6
  m_Component:
  - component: {fileID: 1439336918}
  - component: {fileID: 1439336917}
  m_Layer: 0
  m_Name: Directional Light
  m_TagString: Untagged
  m_Icon: {fileID: 0}
  m_NavMeshLayer: 0
  m_StaticEditorFlags: 0
  m_IsActive: 1
--- !u!108 &1439336917
Light:
  m_ObjectHideFlags: 0
  m_CorrespondingSourceObject: {fileID: 0}
  m_PrefabInstance: {fileID: 0}
  m_PrefabAsset: {fileID: 0}
  m_GameObject: {fileID: 1439336916}
  m_Enabled: 1
  serializedVersion: 10
  m_Type: 1
  m_Shape: 0
  m_Color: {r: 1, g: 0.95686275, b: 0.8392157, a: 1}
  m_Intensity: 1
  m_Range: 10
  m_SpotAngle: 30
  m_InnerSpotAngle: 21.80208
  m_CookieSize: 10
  m_Shadows:
    m_Type: 2
    m_Resolution: 3
    m_CustomResolution: -1
    m_Strength: 1
    m_Bias: 0.008
    m_NormalBias: 0
    m_NearPlane: 0.2
    m_CullingMatrixOverride:
      e00: 1
      e01: 0
      e02: 0
      e03: 0
      e10: 0
      e11: 1
      e12: 0
      e13: 0
      e20: 0
      e21: 0
      e22: 1
      e23: 0
      e30: 0
      e31: 0
      e32: 0
      e33: 1
    m_UseCullingMatrixOverride: 0
  m_Cookie: {fileID: 0}
  m_DrawHalo: 0
  m_Flare: {fileID: 0}
  m_RenderMode: 0
  m_CullingMask:
    serializedVersion: 2
    m_Bits: 4294967295
  m_RenderingLayerMask: 1
  m_Lightmapping: 4
  m_LightShadowCasterMode: 0
  m_AreaSize: {x: 1, y: 1}
  m_BounceIntensity: 1
  m_ColorTemperature: 6570
  m_UseColorTemperature: 0
  m_BoundingSphereOverride: {x: 0, y: 0, z: 0, w: 0}
  m_UseBoundingSphereOverride: 0
  m_ShadowRadius: 0
  m_ShadowAngle: 0
--- !u!4 &1439336918
Transform:
  m_ObjectHideFlags: 0
  m_CorrespondingSourceObject: {fileID: 0}
  m_PrefabInstance: {fileID: 0}
  m_PrefabAsset: {fileID: 0}
  m_GameObject: {fileID: 1439336916}
  m_LocalRotation: {x: 0.5241773, y: -0.69463444, z: 0.2894472, w: 0.3986747}
  m_LocalPosition: {x: 0, y: 3, z: 0}
  m_LocalScale: {x: 1, y: 1, z: 1}
  m_Children: []
  m_Father: {fileID: 0}
  m_RootOrder: 1
  m_LocalEulerAnglesHint: {x: 55.092003, y: -154.04901, z: -60.371002}
--- !u!1001 &1448346097
PrefabInstance:
  m_ObjectHideFlags: 0
  serializedVersion: 2
  m_Modification:
    m_TransformParent: {fileID: 0}
    m_Modifications:
    - target: {fileID: 4428773486379672, guid: 8b6d64ee77895b24ba2e0fe87fa0e2df, type: 3}
      propertyPath: m_RootOrder
      value: 23
      objectReference: {fileID: 0}
    - target: {fileID: 4428773486379672, guid: 8b6d64ee77895b24ba2e0fe87fa0e2df, type: 3}
      propertyPath: m_LocalPosition.x
      value: -2.214
      objectReference: {fileID: 0}
    - target: {fileID: 4428773486379672, guid: 8b6d64ee77895b24ba2e0fe87fa0e2df, type: 3}
      propertyPath: m_LocalPosition.y
      value: 0.005
      objectReference: {fileID: 0}
    - target: {fileID: 4428773486379672, guid: 8b6d64ee77895b24ba2e0fe87fa0e2df, type: 3}
      propertyPath: m_LocalPosition.z
      value: 1.056
      objectReference: {fileID: 0}
    - target: {fileID: 4428773486379672, guid: 8b6d64ee77895b24ba2e0fe87fa0e2df, type: 3}
      propertyPath: m_LocalRotation.w
      value: 0.5273602
      objectReference: {fileID: 0}
    - target: {fileID: 4428773486379672, guid: 8b6d64ee77895b24ba2e0fe87fa0e2df, type: 3}
      propertyPath: m_LocalRotation.x
      value: -0.44770527
      objectReference: {fileID: 0}
    - target: {fileID: 4428773486379672, guid: 8b6d64ee77895b24ba2e0fe87fa0e2df, type: 3}
      propertyPath: m_LocalRotation.y
      value: -0.5238817
      objectReference: {fileID: 0}
    - target: {fileID: 4428773486379672, guid: 8b6d64ee77895b24ba2e0fe87fa0e2df, type: 3}
      propertyPath: m_LocalRotation.z
      value: 0.49699017
      objectReference: {fileID: 0}
    - target: {fileID: 4428773486379672, guid: 8b6d64ee77895b24ba2e0fe87fa0e2df, type: 3}
      propertyPath: m_LocalEulerAnglesHint.x
      value: 2.7810001
      objectReference: {fileID: 0}
    - target: {fileID: 4428773486379672, guid: 8b6d64ee77895b24ba2e0fe87fa0e2df, type: 3}
      propertyPath: m_LocalEulerAnglesHint.y
      value: -87.118004
      objectReference: {fileID: 0}
    - target: {fileID: 4428773486379672, guid: 8b6d64ee77895b24ba2e0fe87fa0e2df, type: 3}
      propertyPath: m_LocalEulerAnglesHint.z
      value: 83.95901
      objectReference: {fileID: 0}
    m_RemovedComponents: []
  m_SourcePrefab: {fileID: 100100000, guid: 8b6d64ee77895b24ba2e0fe87fa0e2df, type: 3}
--- !u!1001 &1458288552
PrefabInstance:
  m_ObjectHideFlags: 0
  serializedVersion: 2
  m_Modification:
    m_TransformParent: {fileID: 0}
    m_Modifications:
    - target: {fileID: 4329442387709482, guid: 563f33ec243972442a81d8bdff4d40ad, type: 3}
      propertyPath: m_RootOrder
      value: 8
      objectReference: {fileID: 0}
    - target: {fileID: 4329442387709482, guid: 563f33ec243972442a81d8bdff4d40ad, type: 3}
      propertyPath: m_LocalPosition.x
      value: -1.394
      objectReference: {fileID: 0}
    - target: {fileID: 4329442387709482, guid: 563f33ec243972442a81d8bdff4d40ad, type: 3}
      propertyPath: m_LocalPosition.y
      value: -0.007
      objectReference: {fileID: 0}
    - target: {fileID: 4329442387709482, guid: 563f33ec243972442a81d8bdff4d40ad, type: 3}
      propertyPath: m_LocalPosition.z
      value: 1.112
      objectReference: {fileID: 0}
    - target: {fileID: 4329442387709482, guid: 563f33ec243972442a81d8bdff4d40ad, type: 3}
      propertyPath: m_LocalRotation.w
      value: 0.68294483
      objectReference: {fileID: 0}
    - target: {fileID: 4329442387709482, guid: 563f33ec243972442a81d8bdff4d40ad, type: 3}
      propertyPath: m_LocalRotation.x
      value: -0.68294513
      objectReference: {fileID: 0}
    - target: {fileID: 4329442387709482, guid: 563f33ec243972442a81d8bdff4d40ad, type: 3}
      propertyPath: m_LocalRotation.y
      value: 0.18326546
      objectReference: {fileID: 0}
    - target: {fileID: 4329442387709482, guid: 563f33ec243972442a81d8bdff4d40ad, type: 3}
      propertyPath: m_LocalRotation.z
      value: -0.18326522
      objectReference: {fileID: 0}
    - target: {fileID: 4329442387709482, guid: 563f33ec243972442a81d8bdff4d40ad, type: 3}
      propertyPath: m_LocalEulerAnglesHint.x
      value: -59.958004
      objectReference: {fileID: 0}
    - target: {fileID: 4329442387709482, guid: 563f33ec243972442a81d8bdff4d40ad, type: 3}
      propertyPath: m_LocalEulerAnglesHint.y
      value: 90.00001
      objectReference: {fileID: 0}
    - target: {fileID: 4329442387709482, guid: 563f33ec243972442a81d8bdff4d40ad, type: 3}
      propertyPath: m_LocalEulerAnglesHint.z
      value: -90.00001
      objectReference: {fileID: 0}
    m_RemovedComponents: []
  m_SourcePrefab: {fileID: 100100000, guid: 563f33ec243972442a81d8bdff4d40ad, type: 3}
--- !u!1001 &1488385775
PrefabInstance:
  m_ObjectHideFlags: 0
  serializedVersion: 2
  m_Modification:
    m_TransformParent: {fileID: 0}
    m_Modifications:
    - target: {fileID: 4273341786318090, guid: d32b5d707dece764d8b0e83612b116d8, type: 3}
      propertyPath: m_RootOrder
      value: 16
      objectReference: {fileID: 0}
    - target: {fileID: 4273341786318090, guid: d32b5d707dece764d8b0e83612b116d8, type: 3}
      propertyPath: m_LocalPosition.x
      value: -1.599
      objectReference: {fileID: 0}
    - target: {fileID: 4273341786318090, guid: d32b5d707dece764d8b0e83612b116d8, type: 3}
      propertyPath: m_LocalPosition.y
      value: 0.040000003
      objectReference: {fileID: 0}
    - target: {fileID: 4273341786318090, guid: d32b5d707dece764d8b0e83612b116d8, type: 3}
      propertyPath: m_LocalPosition.z
      value: 1.071
      objectReference: {fileID: 0}
    - target: {fileID: 4273341786318090, guid: d32b5d707dece764d8b0e83612b116d8, type: 3}
      propertyPath: m_LocalRotation.w
      value: 0.5000002
      objectReference: {fileID: 0}
    - target: {fileID: 4273341786318090, guid: d32b5d707dece764d8b0e83612b116d8, type: 3}
      propertyPath: m_LocalRotation.x
      value: -0.49999994
      objectReference: {fileID: 0}
    - target: {fileID: 4273341786318090, guid: d32b5d707dece764d8b0e83612b116d8, type: 3}
      propertyPath: m_LocalRotation.y
      value: -0.49999994
      objectReference: {fileID: 0}
    - target: {fileID: 4273341786318090, guid: d32b5d707dece764d8b0e83612b116d8, type: 3}
      propertyPath: m_LocalRotation.z
      value: 0.50000006
      objectReference: {fileID: 0}
    - target: {fileID: 4273341786318090, guid: d32b5d707dece764d8b0e83612b116d8, type: 3}
      propertyPath: m_LocalEulerAnglesHint.y
      value: -90.00001
      objectReference: {fileID: 0}
    - target: {fileID: 4273341786318090, guid: d32b5d707dece764d8b0e83612b116d8, type: 3}
      propertyPath: m_LocalEulerAnglesHint.z
      value: 90.00001
      objectReference: {fileID: 0}
    m_RemovedComponents: []
  m_SourcePrefab: {fileID: 100100000, guid: d32b5d707dece764d8b0e83612b116d8, type: 3}
--- !u!1001 &1566270097
PrefabInstance:
  m_ObjectHideFlags: 0
  serializedVersion: 2
  m_Modification:
    m_TransformParent: {fileID: 0}
    m_Modifications:
    - target: {fileID: 4558924850942094, guid: de77c2c20655ee34dab7c81aa9dbb58a, type: 3}
      propertyPath: m_RootOrder
      value: 17
      objectReference: {fileID: 0}
    - target: {fileID: 4558924850942094, guid: de77c2c20655ee34dab7c81aa9dbb58a, type: 3}
      propertyPath: m_LocalPosition.x
      value: -0.679
      objectReference: {fileID: 0}
    - target: {fileID: 4558924850942094, guid: de77c2c20655ee34dab7c81aa9dbb58a, type: 3}
      propertyPath: m_LocalPosition.y
      value: 0.026
      objectReference: {fileID: 0}
    - target: {fileID: 4558924850942094, guid: de77c2c20655ee34dab7c81aa9dbb58a, type: 3}
      propertyPath: m_LocalPosition.z
      value: 1.344
      objectReference: {fileID: 0}
    - target: {fileID: 4558924850942094, guid: de77c2c20655ee34dab7c81aa9dbb58a, type: 3}
      propertyPath: m_LocalRotation.w
      value: 0.5000001
      objectReference: {fileID: 0}
    - target: {fileID: 4558924850942094, guid: de77c2c20655ee34dab7c81aa9dbb58a, type: 3}
      propertyPath: m_LocalRotation.x
      value: -0.49999997
      objectReference: {fileID: 0}
    - target: {fileID: 4558924850942094, guid: de77c2c20655ee34dab7c81aa9dbb58a, type: 3}
      propertyPath: m_LocalRotation.y
      value: -0.50000006
      objectReference: {fileID: 0}
    - target: {fileID: 4558924850942094, guid: de77c2c20655ee34dab7c81aa9dbb58a, type: 3}
      propertyPath: m_LocalRotation.z
      value: 0.49999997
      objectReference: {fileID: 0}
    - target: {fileID: 4558924850942094, guid: de77c2c20655ee34dab7c81aa9dbb58a, type: 3}
      propertyPath: m_LocalEulerAnglesHint.y
      value: -90.00001
      objectReference: {fileID: 0}
    - target: {fileID: 4558924850942094, guid: de77c2c20655ee34dab7c81aa9dbb58a, type: 3}
      propertyPath: m_LocalEulerAnglesHint.z
      value: 90.00001
      objectReference: {fileID: 0}
    m_RemovedComponents: []
  m_SourcePrefab: {fileID: 100100000, guid: de77c2c20655ee34dab7c81aa9dbb58a, type: 3}
--- !u!1 &1644108114
GameObject:
  m_ObjectHideFlags: 0
  m_CorrespondingSourceObject: {fileID: 0}
  m_PrefabInstance: {fileID: 0}
  m_PrefabAsset: {fileID: 0}
  serializedVersion: 6
  m_Component:
  - component: {fileID: 1644108118}
  - component: {fileID: 1644108117}
  - component: {fileID: 1644108116}
  - component: {fileID: 1644108115}
  m_Layer: 0
  m_Name: Plane
  m_TagString: Untagged
  m_Icon: {fileID: 0}
  m_NavMeshLayer: 0
  m_StaticEditorFlags: 0
  m_IsActive: 1
--- !u!23 &1644108115
MeshRenderer:
  m_ObjectHideFlags: 0
  m_CorrespondingSourceObject: {fileID: 0}
  m_PrefabInstance: {fileID: 0}
  m_PrefabAsset: {fileID: 0}
  m_GameObject: {fileID: 1644108114}
  m_Enabled: 1
  m_CastShadows: 0
  m_ReceiveShadows: 1
  m_DynamicOccludee: 1
  m_MotionVectors: 1
  m_LightProbeUsage: 1
  m_ReflectionProbeUsage: 1
  m_RayTracingMode: 2
  m_RenderingLayerMask: 1
  m_RendererPriority: 0
  m_Materials:
  - {fileID: 2100000, guid: c7d5a0685271c8d4fb38e5098384aa92, type: 2}
  m_StaticBatchInfo:
    firstSubMesh: 0
    subMeshCount: 0
  m_StaticBatchRoot: {fileID: 0}
  m_ProbeAnchor: {fileID: 0}
  m_LightProbeVolumeOverride: {fileID: 0}
  m_ScaleInLightmap: 1
  m_ReceiveGI: 1
  m_PreserveUVs: 1
  m_IgnoreNormalsForChartDetection: 0
  m_ImportantGI: 0
  m_StitchLightmapSeams: 1
  m_SelectedEditorRenderState: 3
  m_MinimumChartSize: 4
  m_AutoUVMaxDistance: 0.5
  m_AutoUVMaxAngle: 89
  m_LightmapParameters: {fileID: 0}
  m_SortingLayerID: 0
  m_SortingLayer: 0
  m_SortingOrder: 0
--- !u!64 &1644108116
MeshCollider:
  m_ObjectHideFlags: 0
  m_CorrespondingSourceObject: {fileID: 0}
  m_PrefabInstance: {fileID: 0}
  m_PrefabAsset: {fileID: 0}
  m_GameObject: {fileID: 1644108114}
  m_Material: {fileID: 0}
  m_IsTrigger: 0
  m_Enabled: 1
  serializedVersion: 4
  m_Convex: 0
  m_CookingOptions: 30
  m_Mesh: {fileID: 10209, guid: 0000000000000000e000000000000000, type: 0}
--- !u!33 &1644108117
MeshFilter:
  m_ObjectHideFlags: 0
  m_CorrespondingSourceObject: {fileID: 0}
  m_PrefabInstance: {fileID: 0}
  m_PrefabAsset: {fileID: 0}
  m_GameObject: {fileID: 1644108114}
  m_Mesh: {fileID: 10209, guid: 0000000000000000e000000000000000, type: 0}
--- !u!4 &1644108118
Transform:
  m_ObjectHideFlags: 0
  m_CorrespondingSourceObject: {fileID: 0}
  m_PrefabInstance: {fileID: 0}
  m_PrefabAsset: {fileID: 0}
  m_GameObject: {fileID: 1644108114}
  m_LocalRotation: {x: 0, y: 0, z: 0, w: 1}
  m_LocalPosition: {x: -1.47, y: 0, z: -0.96}
  m_LocalScale: {x: 0.8652361, y: 1, z: 0.80107117}
  m_Children: []
  m_Father: {fileID: 0}
  m_RootOrder: 27
  m_LocalEulerAnglesHint: {x: 0, y: 0, z: 0}
--- !u!1 &1811738481
GameObject:
  m_ObjectHideFlags: 0
  m_CorrespondingSourceObject: {fileID: 0}
  m_PrefabInstance: {fileID: 0}
  m_PrefabAsset: {fileID: 0}
  serializedVersion: 6
  m_Component:
  - component: {fileID: 1811738483}
  - component: {fileID: 1811738482}
  m_Layer: 0
  m_Name: Directional Light (1)
  m_TagString: Untagged
  m_Icon: {fileID: 0}
  m_NavMeshLayer: 0
  m_StaticEditorFlags: 0
  m_IsActive: 1
--- !u!108 &1811738482
Light:
  m_ObjectHideFlags: 0
  m_CorrespondingSourceObject: {fileID: 0}
  m_PrefabInstance: {fileID: 0}
  m_PrefabAsset: {fileID: 0}
  m_GameObject: {fileID: 1811738481}
  m_Enabled: 1
  serializedVersion: 10
  m_Type: 1
  m_Shape: 0
  m_Color: {r: 1, g: 0.95686275, b: 0.8392157, a: 1}
  m_Intensity: 0.36
  m_Range: 10
  m_SpotAngle: 30
  m_InnerSpotAngle: 21.80208
  m_CookieSize: 10
  m_Shadows:
    m_Type: 0
    m_Resolution: -1
    m_CustomResolution: -1
    m_Strength: 1
    m_Bias: 0.05
    m_NormalBias: 0.4
    m_NearPlane: 0.2
    m_CullingMatrixOverride:
      e00: 1
      e01: 0
      e02: 0
      e03: 0
      e10: 0
      e11: 1
      e12: 0
      e13: 0
      e20: 0
      e21: 0
      e22: 1
      e23: 0
      e30: 0
      e31: 0
      e32: 0
      e33: 1
    m_UseCullingMatrixOverride: 0
  m_Cookie: {fileID: 0}
  m_DrawHalo: 0
  m_Flare: {fileID: 0}
  m_RenderMode: 0
  m_CullingMask:
    serializedVersion: 2
    m_Bits: 4294967295
  m_RenderingLayerMask: 1
  m_Lightmapping: 4
  m_LightShadowCasterMode: 0
  m_AreaSize: {x: 1, y: 1}
  m_BounceIntensity: 1
  m_ColorTemperature: 6570
  m_UseColorTemperature: 0
  m_BoundingSphereOverride: {x: 0, y: 0, z: 0, w: 0}
  m_UseBoundingSphereOverride: 0
  m_ShadowRadius: 0
  m_ShadowAngle: 0
--- !u!4 &1811738483
Transform:
  m_ObjectHideFlags: 0
  m_CorrespondingSourceObject: {fileID: 0}
  m_PrefabInstance: {fileID: 0}
  m_PrefabAsset: {fileID: 0}
  m_GameObject: {fileID: 1811738481}
  m_LocalRotation: {x: -0.18825704, y: -0.41199556, z: 0.5607228, w: -0.69311535}
  m_LocalPosition: {x: -1.852, y: 3.3, z: 0}
  m_LocalScale: {x: 1, y: 1, z: 1}
  m_Children: []
  m_Father: {fileID: 0}
  m_RootOrder: 25
  m_LocalEulerAnglesHint: {x: 46.303, y: -328.594, z: -64.235}
--- !u!1 &1867916348
GameObject:
  m_ObjectHideFlags: 0
  m_CorrespondingSourceObject: {fileID: 0}
  m_PrefabInstance: {fileID: 0}
  m_PrefabAsset: {fileID: 0}
  serializedVersion: 6
  m_Component:
  - component: {fileID: 1867916350}
  - component: {fileID: 1867916349}
  m_Layer: 0
  m_Name: Point light
  m_TagString: Untagged
  m_Icon: {fileID: 0}
  m_NavMeshLayer: 0
  m_StaticEditorFlags: 0
  m_IsActive: 1
--- !u!108 &1867916349
Light:
  m_ObjectHideFlags: 0
  m_CorrespondingSourceObject: {fileID: 0}
  m_PrefabInstance: {fileID: 0}
  m_PrefabAsset: {fileID: 0}
  m_GameObject: {fileID: 1867916348}
  m_Enabled: 1
  serializedVersion: 10
  m_Type: 2
  m_Shape: 0
  m_Color: {r: 1, g: 1, b: 1, a: 1}
  m_Intensity: 1
  m_Range: 10
  m_SpotAngle: 30
  m_InnerSpotAngle: 21.80208
  m_CookieSize: 10
  m_Shadows:
    m_Type: 0
    m_Resolution: -1
    m_CustomResolution: -1
    m_Strength: 1
    m_Bias: 0.05
    m_NormalBias: 0.4
    m_NearPlane: 0.2
    m_CullingMatrixOverride:
      e00: 1
      e01: 0
      e02: 0
      e03: 0
      e10: 0
      e11: 1
      e12: 0
      e13: 0
      e20: 0
      e21: 0
      e22: 1
      e23: 0
      e30: 0
      e31: 0
      e32: 0
      e33: 1
    m_UseCullingMatrixOverride: 0
  m_Cookie: {fileID: 0}
  m_DrawHalo: 0
  m_Flare: {fileID: 0}
  m_RenderMode: 0
  m_CullingMask:
    serializedVersion: 2
    m_Bits: 4294967295
  m_RenderingLayerMask: 1
  m_Lightmapping: 4
  m_LightShadowCasterMode: 0
  m_AreaSize: {x: 1, y: 1}
  m_BounceIntensity: 1
  m_ColorTemperature: 6570
  m_UseColorTemperature: 0
  m_BoundingSphereOverride: {x: 0, y: 0, z: 0, w: 0}
  m_UseBoundingSphereOverride: 0
  m_ShadowRadius: 0
  m_ShadowAngle: 0
--- !u!4 &1867916350
Transform:
  m_ObjectHideFlags: 0
  m_CorrespondingSourceObject: {fileID: 0}
  m_PrefabInstance: {fileID: 0}
  m_PrefabAsset: {fileID: 0}
  m_GameObject: {fileID: 1867916348}
  m_LocalRotation: {x: 0, y: 0, z: 0, w: 1}
  m_LocalPosition: {x: -4.07, y: 1.6792235, z: -1.289}
  m_LocalScale: {x: 1, y: 1, z: 1}
  m_Children: []
  m_Father: {fileID: 0}
  m_RootOrder: 26
  m_LocalEulerAnglesHint: {x: 0, y: 0, z: 0}
--- !u!1001 &1927226148
PrefabInstance:
  m_ObjectHideFlags: 0
  serializedVersion: 2
  m_Modification:
    m_TransformParent: {fileID: 0}
    m_Modifications:
    - target: {fileID: 4218402260316498, guid: be310a6d4c4447f4eb194e270daefd49, type: 3}
      propertyPath: m_RootOrder
      value: 14
      objectReference: {fileID: 0}
    - target: {fileID: 4218402260316498, guid: be310a6d4c4447f4eb194e270daefd49, type: 3}
      propertyPath: m_LocalPosition.x
      value: 0.062
      objectReference: {fileID: 0}
    - target: {fileID: 4218402260316498, guid: be310a6d4c4447f4eb194e270daefd49, type: 3}
      propertyPath: m_LocalPosition.y
      value: 0
      objectReference: {fileID: 0}
    - target: {fileID: 4218402260316498, guid: be310a6d4c4447f4eb194e270daefd49, type: 3}
      propertyPath: m_LocalPosition.z
      value: 1.149
      objectReference: {fileID: 0}
    - target: {fileID: 4218402260316498, guid: be310a6d4c4447f4eb194e270daefd49, type: 3}
      propertyPath: m_LocalRotation.w
      value: 0.99776495
      objectReference: {fileID: 0}
    - target: {fileID: 4218402260316498, guid: be310a6d4c4447f4eb194e270daefd49, type: 3}
      propertyPath: m_LocalRotation.x
      value: -0
      objectReference: {fileID: 0}
    - target: {fileID: 4218402260316498, guid: be310a6d4c4447f4eb194e270daefd49, type: 3}
      propertyPath: m_LocalRotation.y
      value: -0.06682264
      objectReference: {fileID: 0}
    - target: {fileID: 4218402260316498, guid: be310a6d4c4447f4eb194e270daefd49, type: 3}
      propertyPath: m_LocalRotation.z
      value: -0
      objectReference: {fileID: 0}
    - target: {fileID: 4218402260316498, guid: be310a6d4c4447f4eb194e270daefd49, type: 3}
      propertyPath: m_LocalEulerAnglesHint.y
      value: -7.6630006
      objectReference: {fileID: 0}
    m_RemovedComponents: []
  m_SourcePrefab: {fileID: 100100000, guid: be310a6d4c4447f4eb194e270daefd49, type: 3}
--- !u!1001 &1950371491
PrefabInstance:
  m_ObjectHideFlags: 0
  serializedVersion: 2
  m_Modification:
    m_TransformParent: {fileID: 0}
    m_Modifications:
    - target: {fileID: 4610527358027146, guid: 23205be0f9e922a409362d919454a8ec, type: 3}
      propertyPath: m_RootOrder
      value: 7
      objectReference: {fileID: 0}
    - target: {fileID: 4610527358027146, guid: 23205be0f9e922a409362d919454a8ec, type: 3}
      propertyPath: m_LocalScale.x
      value: 1.06
      objectReference: {fileID: 0}
    - target: {fileID: 4610527358027146, guid: 23205be0f9e922a409362d919454a8ec, type: 3}
      propertyPath: m_LocalScale.y
      value: 1.06
      objectReference: {fileID: 0}
    - target: {fileID: 4610527358027146, guid: 23205be0f9e922a409362d919454a8ec, type: 3}
      propertyPath: m_LocalScale.z
      value: 1.06
      objectReference: {fileID: 0}
    - target: {fileID: 4610527358027146, guid: 23205be0f9e922a409362d919454a8ec, type: 3}
      propertyPath: m_LocalPosition.x
      value: -1.393
      objectReference: {fileID: 0}
    - target: {fileID: 4610527358027146, guid: 23205be0f9e922a409362d919454a8ec, type: 3}
      propertyPath: m_LocalPosition.y
      value: 0
      objectReference: {fileID: 0}
    - target: {fileID: 4610527358027146, guid: 23205be0f9e922a409362d919454a8ec, type: 3}
      propertyPath: m_LocalPosition.z
      value: 0.675
      objectReference: {fileID: 0}
    - target: {fileID: 4610527358027146, guid: 23205be0f9e922a409362d919454a8ec, type: 3}
      propertyPath: m_LocalRotation.w
      value: 1
      objectReference: {fileID: 0}
    - target: {fileID: 4610527358027146, guid: 23205be0f9e922a409362d919454a8ec, type: 3}
      propertyPath: m_LocalRotation.x
      value: 0
      objectReference: {fileID: 0}
    - target: {fileID: 4610527358027146, guid: 23205be0f9e922a409362d919454a8ec, type: 3}
      propertyPath: m_LocalRotation.y
      value: -0
      objectReference: {fileID: 0}
    - target: {fileID: 4610527358027146, guid: 23205be0f9e922a409362d919454a8ec, type: 3}
      propertyPath: m_LocalRotation.z
      value: -0
      objectReference: {fileID: 0}
    m_RemovedComponents: []
  m_SourcePrefab: {fileID: 100100000, guid: 23205be0f9e922a409362d919454a8ec, type: 3}
--- !u!1001 &1956022276
PrefabInstance:
  m_ObjectHideFlags: 0
  serializedVersion: 2
  m_Modification:
    m_TransformParent: {fileID: 0}
    m_Modifications:
    - target: {fileID: 4241723675729052, guid: 01d723dd750749c45aafc607856b4dfd, type: 3}
      propertyPath: m_RootOrder
      value: 13
      objectReference: {fileID: 0}
    - target: {fileID: 4241723675729052, guid: 01d723dd750749c45aafc607856b4dfd, type: 3}
      propertyPath: m_LocalPosition.x
      value: -0.271
      objectReference: {fileID: 0}
    - target: {fileID: 4241723675729052, guid: 01d723dd750749c45aafc607856b4dfd, type: 3}
      propertyPath: m_LocalPosition.y
      value: 0
      objectReference: {fileID: 0}
    - target: {fileID: 4241723675729052, guid: 01d723dd750749c45aafc607856b4dfd, type: 3}
      propertyPath: m_LocalPosition.z
      value: 1.179
      objectReference: {fileID: 0}
    - target: {fileID: 4241723675729052, guid: 01d723dd750749c45aafc607856b4dfd, type: 3}
      propertyPath: m_LocalRotation.w
      value: 1
      objectReference: {fileID: 0}
    - target: {fileID: 4241723675729052, guid: 01d723dd750749c45aafc607856b4dfd, type: 3}
      propertyPath: m_LocalRotation.x
      value: 0
      objectReference: {fileID: 0}
    - target: {fileID: 4241723675729052, guid: 01d723dd750749c45aafc607856b4dfd, type: 3}
      propertyPath: m_LocalRotation.y
      value: -0
      objectReference: {fileID: 0}
    - target: {fileID: 4241723675729052, guid: 01d723dd750749c45aafc607856b4dfd, type: 3}
      propertyPath: m_LocalRotation.z
      value: -0
      objectReference: {fileID: 0}
    m_RemovedComponents: []
  m_SourcePrefab: {fileID: 100100000, guid: 01d723dd750749c45aafc607856b4dfd, type: 3}
--- !u!1001 &2029823120
PrefabInstance:
  m_ObjectHideFlags: 0
  serializedVersion: 2
  m_Modification:
    m_TransformParent: {fileID: 0}
    m_Modifications:
    - target: {fileID: 4595302078227230, guid: dace9b50a70a6f64c821237ef7768e2f, type: 3}
      propertyPath: m_RootOrder
      value: 19
      objectReference: {fileID: 0}
    - target: {fileID: 4595302078227230, guid: dace9b50a70a6f64c821237ef7768e2f, type: 3}
      propertyPath: m_LocalPosition.x
      value: -0.265
      objectReference: {fileID: 0}
    - target: {fileID: 4595302078227230, guid: dace9b50a70a6f64c821237ef7768e2f, type: 3}
      propertyPath: m_LocalPosition.y
      value: -0.074
      objectReference: {fileID: 0}
    - target: {fileID: 4595302078227230, guid: dace9b50a70a6f64c821237ef7768e2f, type: 3}
      propertyPath: m_LocalPosition.z
      value: 0.516
      objectReference: {fileID: 0}
    - target: {fileID: 4595302078227230, guid: dace9b50a70a6f64c821237ef7768e2f, type: 3}
      propertyPath: m_LocalRotation.w
      value: 0.9416057
      objectReference: {fileID: 0}
    - target: {fileID: 4595302078227230, guid: dace9b50a70a6f64c821237ef7768e2f, type: 3}
      propertyPath: m_LocalRotation.x
      value: -0.035900477
      objectReference: {fileID: 0}
    - target: {fileID: 4595302078227230, guid: dace9b50a70a6f64c821237ef7768e2f, type: 3}
      propertyPath: m_LocalRotation.y
      value: -0.32561982
      objectReference: {fileID: 0}
    - target: {fileID: 4595302078227230, guid: dace9b50a70a6f64c821237ef7768e2f, type: 3}
      propertyPath: m_LocalRotation.z
      value: 0.07785707
      objectReference: {fileID: 0}
    - target: {fileID: 4595302078227230, guid: dace9b50a70a6f64c821237ef7768e2f, type: 3}
      propertyPath: m_LocalEulerAnglesHint.x
      value: -0.96900004
      objectReference: {fileID: 0}
    - target: {fileID: 4595302078227230, guid: dace9b50a70a6f64c821237ef7768e2f, type: 3}
      propertyPath: m_LocalEulerAnglesHint.y
      value: -38.235
      objectReference: {fileID: 0}
    - target: {fileID: 4595302078227230, guid: dace9b50a70a6f64c821237ef7768e2f, type: 3}
      propertyPath: m_LocalEulerAnglesHint.z
      value: 9.7890005
      objectReference: {fileID: 0}
    m_RemovedComponents: []
  m_SourcePrefab: {fileID: 100100000, guid: dace9b50a70a6f64c821237ef7768e2f, type: 3}
--- !u!1001 &2030365074
PrefabInstance:
  m_ObjectHideFlags: 0
  serializedVersion: 2
  m_Modification:
    m_TransformParent: {fileID: 0}
    m_Modifications:
    - target: {fileID: 4991077963205644, guid: 90c0b607c5f396946975c9ab08d8523a, type: 3}
      propertyPath: m_RootOrder
      value: 24
      objectReference: {fileID: 0}
    - target: {fileID: 4991077963205644, guid: 90c0b607c5f396946975c9ab08d8523a, type: 3}
      propertyPath: m_LocalPosition.x
      value: -2.2950332
      objectReference: {fileID: 0}
    - target: {fileID: 4991077963205644, guid: 90c0b607c5f396946975c9ab08d8523a, type: 3}
      propertyPath: m_LocalPosition.y
      value: -0.02262532
      objectReference: {fileID: 0}
    - target: {fileID: 4991077963205644, guid: 90c0b607c5f396946975c9ab08d8523a, type: 3}
      propertyPath: m_LocalPosition.z
      value: 0.68
      objectReference: {fileID: 0}
    - target: {fileID: 4991077963205644, guid: 90c0b607c5f396946975c9ab08d8523a, type: 3}
      propertyPath: m_LocalRotation.w
      value: 0.5000002
      objectReference: {fileID: 0}
    - target: {fileID: 4991077963205644, guid: 90c0b607c5f396946975c9ab08d8523a, type: 3}
      propertyPath: m_LocalRotation.x
      value: -0.5000003
      objectReference: {fileID: 0}
    - target: {fileID: 4991077963205644, guid: 90c0b607c5f396946975c9ab08d8523a, type: 3}
      propertyPath: m_LocalRotation.y
      value: 0.49999982
      objectReference: {fileID: 0}
    - target: {fileID: 4991077963205644, guid: 90c0b607c5f396946975c9ab08d8523a, type: 3}
      propertyPath: m_LocalRotation.z
      value: -0.4999997
      objectReference: {fileID: 0}
    - target: {fileID: 4991077963205644, guid: 90c0b607c5f396946975c9ab08d8523a, type: 3}
      propertyPath: m_LocalEulerAnglesHint.x
      value: 0
      objectReference: {fileID: 0}
    - target: {fileID: 4991077963205644, guid: 90c0b607c5f396946975c9ab08d8523a, type: 3}
      propertyPath: m_LocalEulerAnglesHint.y
      value: -270
      objectReference: {fileID: 0}
    - target: {fileID: 4991077963205644, guid: 90c0b607c5f396946975c9ab08d8523a, type: 3}
      propertyPath: m_LocalEulerAnglesHint.z
      value: 270
      objectReference: {fileID: 0}
    m_RemovedComponents: []
  m_SourcePrefab: {fileID: 100100000, guid: 90c0b607c5f396946975c9ab08d8523a, type: 3}
--- !u!1001 &2055449622
PrefabInstance:
  m_ObjectHideFlags: 0
  serializedVersion: 2
  m_Modification:
    m_TransformParent: {fileID: 0}
    m_Modifications:
    - target: {fileID: 1759828065216730, guid: 8c84a68a6ecac2b40ace8c1e732ac78a, type: 3}
      propertyPath: m_IsActive
      value: 0
      objectReference: {fileID: 0}
    - target: {fileID: 1770323274648356, guid: 8c84a68a6ecac2b40ace8c1e732ac78a, type: 3}
      propertyPath: m_IsActive
      value: 0
      objectReference: {fileID: 0}
    - target: {fileID: 1824678824116424, guid: 8c84a68a6ecac2b40ace8c1e732ac78a, type: 3}
      propertyPath: m_IsActive
      value: 1
      objectReference: {fileID: 0}
    - target: {fileID: 4435402632355884, guid: 8c84a68a6ecac2b40ace8c1e732ac78a, type: 3}
      propertyPath: m_RootOrder
      value: 3
      objectReference: {fileID: 0}
    - target: {fileID: 4435402632355884, guid: 8c84a68a6ecac2b40ace8c1e732ac78a, type: 3}
      propertyPath: m_LocalPosition.x
      value: -0.557
      objectReference: {fileID: 0}
    - target: {fileID: 4435402632355884, guid: 8c84a68a6ecac2b40ace8c1e732ac78a, type: 3}
      propertyPath: m_LocalPosition.y
      value: -0.014
      objectReference: {fileID: 0}
    - target: {fileID: 4435402632355884, guid: 8c84a68a6ecac2b40ace8c1e732ac78a, type: 3}
      propertyPath: m_LocalPosition.z
      value: -0.186
      objectReference: {fileID: 0}
    - target: {fileID: 4435402632355884, guid: 8c84a68a6ecac2b40ace8c1e732ac78a, type: 3}
      propertyPath: m_LocalRotation.w
      value: 0.9798289
      objectReference: {fileID: 0}
    - target: {fileID: 4435402632355884, guid: 8c84a68a6ecac2b40ace8c1e732ac78a, type: 3}
      propertyPath: m_LocalRotation.x
      value: -0.043813355
      objectReference: {fileID: 0}
    - target: {fileID: 4435402632355884, guid: 8c84a68a6ecac2b40ace8c1e732ac78a, type: 3}
      propertyPath: m_LocalRotation.y
      value: -0.19497636
      objectReference: {fileID: 0}
    - target: {fileID: 4435402632355884, guid: 8c84a68a6ecac2b40ace8c1e732ac78a, type: 3}
      propertyPath: m_LocalRotation.z
      value: 0.00032720203
      objectReference: {fileID: 0}
    - target: {fileID: 4435402632355884, guid: 8c84a68a6ecac2b40ace8c1e732ac78a, type: 3}
      propertyPath: m_LocalEulerAnglesHint.x
      value: -4.918
      objectReference: {fileID: 0}
    - target: {fileID: 4435402632355884, guid: 8c84a68a6ecac2b40ace8c1e732ac78a, type: 3}
      propertyPath: m_LocalEulerAnglesHint.y
      value: -22.552002
      objectReference: {fileID: 0}
    - target: {fileID: 4435402632355884, guid: 8c84a68a6ecac2b40ace8c1e732ac78a, type: 3}
      propertyPath: m_LocalEulerAnglesHint.z
      value: 1.019
      objectReference: {fileID: 0}
    - target: {fileID: 95810303219782666, guid: 8c84a68a6ecac2b40ace8c1e732ac78a,
        type: 3}
      propertyPath: m_Enabled
      value: 1
      objectReference: {fileID: 0}
    - target: {fileID: 95810303219782666, guid: 8c84a68a6ecac2b40ace8c1e732ac78a,
        type: 3}
      propertyPath: m_Controller
      value: 
      objectReference: {fileID: 9100000, guid: 4b7d7b370a4c10f46a4d07e11ce4fc06, type: 2}
    m_RemovedComponents:
    - {fileID: 95810303219782666, guid: 8c84a68a6ecac2b40ace8c1e732ac78a, type: 3}
  m_SourcePrefab: {fileID: 100100000, guid: 8c84a68a6ecac2b40ace8c1e732ac78a, type: 3}
