%YAML 1.1
%TAG !u! tag:unity3d.com,2011:
--- !u!114 &11400000
MonoBehaviour:
  m_ObjectHideFlags: 0
  m_CorrespondingSourceObject: {fileID: 0}
  m_PrefabInstance: {fileID: 0}
  m_PrefabAsset: {fileID: 0}
  m_GameObject: {fileID: 0}
  m_Enabled: 1
  m_EditorHideFlags: 0
  m_Script: {fileID: 11500000, guid: f987cb797d444784aaa0643797e9d67c, type: 3}
  m_Name: Revolver
  m_EditorClassIdentifier: 
  ID: 1
  icon: {fileID: 21300000, guid: 3e652a597824bd44d91fd93f87e3857d, type: 3}
  chance: 0
  price: 0
  dmg: 5
  ammo: 6
  maxBulletCapacity: 6
  fireRate: 1.5
  bulletXShoot: 1
  range: 6
  speed: 15
  extraEffect: 0
  sound: {fileID: 8300000, guid: f0a64a908599d364c9bee5d6d95be0b8, type: 3}
