%YAML 1.1
%TAG !u! tag:unity3d.com,2011:
--- !u!114 &11400000
MonoBehaviour:
  m_ObjectHideFlags: 0
  m_CorrespondingSourceObject: {fileID: 0}
  m_PrefabInstance: {fileID: 0}
  m_PrefabAsset: {fileID: 0}
  m_GameObject: {fileID: 0}
  m_Enabled: 1
  m_EditorHideFlags: 0
  m_Script: {fileID: 11500000, guid: f987cb797d444784aaa0643797e9d67c, type: 3}
  m_Name: Metralleta
  m_EditorClassIdentifier: 
  ID: 2
  icon: {fileID: 21300000, guid: 8945fc5db7dc6044db378f1382ece111, type: 3}
  chance: 0
  price: 0
  dmg: 1
  ammo: 30
  maxBulletCapacity: 30
  fireRate: 0.1
  bulletXShoot: 1
  range: 6
  speed: 10
  extraEffect: 0
  sound: {fileID: 8300000, guid: 95a711186ce3ebe43afeba9ffc13a87e, type: 3}
