%YAML 1.1
%TAG !u! tag:unity3d.com,2011:
--- !u!114 &11400000
MonoBehaviour:
  m_ObjectHideFlags: 0
  m_CorrespondingSourceObject: {fileID: 0}
  m_PrefabInstance: {fileID: 0}
  m_PrefabAsset: {fileID: 0}
  m_GameObject: {fileID: 0}
  m_Enabled: 1
  m_EditorHideFlags: 0
  m_Script: {fileID: 11500000, guid: 6567cb9da8739d14dbb68503799b8951, type: 3}
  m_Name: Consumible
  m_EditorClassIdentifier: 
  itemName: 
  icon: {fileID: 0}
  chance: 0
  price: 0
  heal: 0
  mana: 0
  speed: 0
  duration: 0
