%YAML 1.1
%TAG !u! tag:unity3d.com,2011:
--- !u!114 &11400000
MonoBehaviour:
  m_ObjectHideFlags: 0
  m_CorrespondingSourceObject: {fileID: 0}
  m_PrefabInstance: {fileID: 0}
  m_PrefabAsset: {fileID: 0}
  m_GameObject: {fileID: 0}
  m_Enabled: 1
  m_EditorHideFlags: 0
  m_Script: {fileID: 11500000, guid: f16df33e207c6bd4ca8943ad07b02968, type: 3}
  m_Name: EnemyHp1
  m_EditorClassIdentifier: 
  itemName: 
  stat: 0
  character: 1
  mult: 0.8
  price: 200
