%YAML 1.1
%TAG !u! tag:unity3d.com,2011:
--- !u!114 &11400000
MonoBehaviour:
  m_ObjectHideFlags: 0
  m_CorrespondingSourceObject: {fileID: 0}
  m_PrefabInstance: {fileID: 0}
  m_PrefabAsset: {fileID: 0}
  m_GameObject: {fileID: 0}
  m_Enabled: 1
  m_EditorHideFlags: 0
  m_Script: {fileID: 11500000, guid: 94ff5028e135c7d42b2c1f663181db7f, type: 3}
  m_Name: Player
  m_EditorClassIdentifier: 
  maxHealth: 100
  currentHealth: 100
  maxSpeed: 5
  acceleration: 20
  pointOnDefeat: 0
