%YAML 1.1
%TAG !u! tag:unity3d.com,2011:
--- !u!114 &11400000
MonoBehaviour:
  m_ObjectHideFlags: 0
  m_CorrespondingSourceObject: {fileID: 0}
  m_PrefabInstance: {fileID: 0}
  m_PrefabAsset: {fileID: 0}
  m_GameObject: {fileID: 0}
  m_Enabled: 1
  m_EditorHideFlags: 0
  m_Script: {fileID: 11500000, guid: ecb27a84c1ef1004d9d63ddf8aa556fe, type: 3}
  m_Name: Mushroom
  m_EditorClassIdentifier: 
  <Name>k__BackingField: Mushroom
  <ItemImage>k__BackingField: {fileID: 21300000, guid: 6270d46c6c1104b448fb5bac5bede74d, type: 3}
