<?xml version="1.0" encoding="UTF-8" standalone="no"?>
<!-- Created with Inkscape (http://www.inkscape.org/) -->
<svg
   xmlns:dc="http://purl.org/dc/elements/1.1/"
   xmlns:cc="http://web.resource.org/cc/"
   xmlns:rdf="http://www.w3.org/1999/02/22-rdf-syntax-ns#"
   xmlns:svg="http://www.w3.org/2000/svg"
   xmlns="http://www.w3.org/2000/svg"
   xmlns:xlink="http://www.w3.org/1999/xlink"
   xmlns:sodipodi="http://inkscape.sourceforge.net/DTD/sodipodi-0.dtd"
   xmlns:inkscape="http://www.inkscape.org/namespaces/inkscape"
   width="25.600000pt"
   height="25.600000pt"
   id="svg2"
   sodipodi:version="0.32"
   inkscape:version="0.42"
   sodipodi:docbase="/home/spoony/dev/workspaces/web/TankWars/html/img/svg"
   sodipodi:docname="p1_down.svg">
  <defs
     id="defs4">
    <linearGradient
       id="linearGradient2072">
      <stop
         style="stop-color:#3c20fe;stop-opacity:1;"
         offset="0"
         id="stop2074" />
      <stop
         style="stop-color:#3c20fe;stop-opacity:0;"
         offset="1"
         id="stop2076" />
    </linearGradient>
    <linearGradient
       id="linearGradient2062">
      <stop
         style="stop-color:#11008c;stop-opacity:1.0000000;"
         offset="0.0000000"
         id="stop2064" />
      <stop
         id="stop2070"
         offset="0.50000000"
         style="stop-color:#8573ff;stop-opacity:1.0000000;" />
      <stop
         style="stop-color:#1c00de;stop-opacity:1.0000000;"
         offset="1.0000000"
         id="stop2066" />
    </linearGradient>
    <linearGradient
       id="linearGradient2054">
      <stop
         style="stop-color:#7b67ff;stop-opacity:1.0000000;"
         offset="0.0000000"
         id="stop2056" />
      <stop
         style="stop-color:#100080;stop-opacity:1.0000000;"
         offset="1.0000000"
         id="stop2058" />
    </linearGradient>
    <radialGradient
       inkscape:collect="always"
       xlink:href="#linearGradient2054"
       id="radialGradient2060"
       cx="16.148148"
       cy="17.201647"
       fx="16.148148"
       fy="17.201647"
       r="7.2325101"
       gradientUnits="userSpaceOnUse" />
    <linearGradient
       inkscape:collect="always"
       xlink:href="#linearGradient2062"
       id="linearGradient2068"
       x1="13.893004"
       y1="19.621399"
       x2="17.975309"
       y2="19.654322"
       gradientUnits="userSpaceOnUse"
       gradientTransform="translate(-0.197530,0.000000)" />
    <linearGradient
       inkscape:collect="always"
       xlink:href="#linearGradient2062"
       id="linearGradient2078"
       x1="11.648149"
       y1="24.230453"
       x2="20.483540"
       y2="24.230453"
       gradientUnits="userSpaceOnUse"
       gradientTransform="translate(-0.279835,0.000000)" />
  </defs>
  <sodipodi:namedview
     id="base"
     pagecolor="#ffffff"
     bordercolor="#666666"
     borderopacity="1.0"
     inkscape:pageopacity="0.0"
     inkscape:pageshadow="2"
     inkscape:zoom="30.375000"
     inkscape:cx="16.000000"
     inkscape:cy="16.000000"
     inkscape:document-units="px"
     inkscape:current-layer="layer1"
     inkscape:window-width="1600"
     inkscape:window-height="1144"
     inkscape:window-x="0"
     inkscape:window-y="6" />
  <metadata
     id="metadata7">
    <rdf:RDF>
      <cc:Work
         rdf:about="">
        <dc:format>image/svg+xml</dc:format>
        <dc:type
           rdf:resource="http://purl.org/dc/dcmitype/StillImage" />
      </cc:Work>
    </rdf:RDF>
  </metadata>
  <g
     inkscape:label="Layer 1"
     inkscape:groupmode="layer"
     id="layer1">
    <rect
       style="opacity:1.0000000;fill:#727272;fill-opacity:1.0000000;fill-rule:evenodd;stroke:none;stroke-width:1.0000000;stroke-linejoin:miter;stroke-miterlimit:2.5999999;stroke-dasharray:none;stroke-opacity:0.055762056"
       id="rect1306"
       width="5.8600817"
       height="15.703705"
       x="4.9053497"
       y="6.4032912" />
    <rect
       style="opacity:1.0000000;fill:#727272;fill-opacity:1.0000000;fill-rule:evenodd;stroke:none;stroke-width:1.0000000;stroke-linejoin:miter;stroke-miterlimit:2.5999999;stroke-dasharray:none;stroke-opacity:0.055762056"
       id="rect2046"
       width="5.8600817"
       height="15.703705"
       x="21.037037"
       y="6.4032912" />
    <path
       sodipodi:type="arc"
       style="opacity:1.0000000;fill:url(#radialGradient2060);fill-opacity:1.0;fill-rule:evenodd;stroke:#000000;stroke-width:1.0000000;stroke-linejoin:miter;stroke-miterlimit:2.5999999;stroke-dasharray:none;stroke-opacity:1.0000000"
       id="path2048"
       sodipodi:cx="16.148148"
       sodipodi:cy="17.201647"
       sodipodi:rx="6.7325101"
       sodipodi:ry="6.7325101"
       d="M 22.880658 17.201647 A 6.7325101 6.7325101 0 1 1  9.4156375,17.201647 A 6.7325101 6.7325101 0 1 1  22.880658 17.201647 z"
       transform="translate(-0.362139,-6.452675)" />
    <rect
       style="opacity:1.0000000;fill:url(#linearGradient2068);fill-opacity:1.0000000;fill-rule:evenodd;stroke:#000000;stroke-width:1.0000000;stroke-linejoin:miter;stroke-miterlimit:2.5999999;stroke-dasharray:none;stroke-opacity:1.0000000"
       id="rect2050"
       width="4.7736626"
       height="8.2304525"
       x="13.399178"
       y="15.078189" />
    <rect
       style="opacity:1.0000000;fill:url(#linearGradient2078);fill-opacity:1.0000000;fill-rule:evenodd;stroke:#000000;stroke-width:1.0000000;stroke-linejoin:miter;stroke-miterlimit:2.5999999;stroke-dasharray:none;stroke-opacity:1.0000000"
       id="rect2052"
       width="7.8353910"
       height="4.4773664"
       x="11.868313"
       y="21.991770" />
  </g>
</svg>
