<?xml version="1.0" encoding="UTF-8" standalone="no"?>
<!-- Created with Inkscape (http://www.inkscape.org/) -->
<svg
   xmlns:dc="http://purl.org/dc/elements/1.1/"
   xmlns:cc="http://web.resource.org/cc/"
   xmlns:rdf="http://www.w3.org/1999/02/22-rdf-syntax-ns#"
   xmlns:svg="http://www.w3.org/2000/svg"
   xmlns="http://www.w3.org/2000/svg"
   xmlns:xlink="http://www.w3.org/1999/xlink"
   xmlns:sodipodi="http://inkscape.sourceforge.net/DTD/sodipodi-0.dtd"
   xmlns:inkscape="http://www.inkscape.org/namespaces/inkscape"
   width="32px"
   height="32px"
   id="svg12142"
   sodipodi:version="0.32"
   inkscape:version="0.43"
   sodipodi:docbase="G:\Medieninformatik\Multimedia II LU\SVG\graphics"
   sodipodi:docname="bomb.svg">
  <defs
     id="defs12144">
    <linearGradient
       id="linearGradient4070">
      <stop
         style="stop-color:#000000;stop-opacity:1;"
         offset="0"
         id="stop4072" />
      <stop
         style="stop-color:#000000;stop-opacity:0"
         offset="1"
         id="stop4074" />
    </linearGradient>
    <linearGradient
       id="linearGradient5800">
      <stop
         style="stop-color:#ecff09;stop-opacity:0;"
         offset="1"
         id="stop5832" />
    </linearGradient>
    <linearGradient
       id="linearGradient5766">
      <stop
         id="stop5770"
         offset="1"
         style="stop-color:#5b5858;stop-opacity:1;" />
      <stop
         style="stop-color:#2f2c2c;stop-opacity:1;"
         offset="1"
         id="stop5772" />
      <stop
         id="stop5774"
         offset="1"
         style="stop-color:#191616;stop-opacity:1;" />
      <stop
         style="stop-color:#0e0b0b;stop-opacity:1;"
         offset="1"
         id="stop5776" />
      <stop
         id="stop5778"
         offset="1"
         style="stop-color:#090505;stop-opacity:1;" />
      <stop
         style="stop-color:#060202;stop-opacity:1;"
         offset="1"
         id="stop5780" />
      <stop
         id="stop5782"
         offset="1"
         style="stop-color:#050101;stop-opacity:1;" />
      <stop
         style="stop-color:#040000;stop-opacity:1;"
         offset="1"
         id="stop5784" />
      <stop
         style="stop-color:#040000;stop-opacity:1;"
         offset="1"
         id="stop5786" />
      <stop
         id="stop5788"
         offset="1"
         style="stop-color:#040000;stop-opacity:1;" />
      <stop
         style="stop-color:#040000;stop-opacity:1;"
         offset="1"
         id="stop5790" />
      <stop
         style="stop-color:#040000;stop-opacity:1;"
         offset="1"
         id="stop5792" />
      <stop
         id="stop5794"
         offset="1"
         style="stop-color:#16ff00;stop-opacity:0.51612902;" />
      <stop
         style="stop-color:#ff0057;stop-opacity:0.40392157;"
         offset="1"
         id="stop5796" />
      <stop
         id="stop5798"
         offset="1"
         style="stop-color:#ecff09;stop-opacity:0;" />
    </linearGradient>
    <linearGradient
       id="linearGradient3093">
      <stop
         style="stop-color:#ffffff;stop-opacity:1;"
         offset="0"
         id="stop3097" />
      <stop
         id="stop3132"
         offset="1"
         style="stop-color:#000000;stop-opacity:1;" />
    </linearGradient>
    <radialGradient
       inkscape:collect="always"
       xlink:href="#linearGradient3093"
       id="radialGradient2247"
       cx="28.393408"
       cy="14.193583"
       fx="28.393408"
       fy="14.193583"
       r="13.061977"
       gradientTransform="matrix(-0.383592,-1.394764,1.30726,-0.359528,8.058833,57.17202)"
       gradientUnits="userSpaceOnUse"
       spreadMethod="reflect" />
    <linearGradient
       inkscape:collect="always"
       xlink:href="#linearGradient3093"
       id="linearGradient4044"
       x1="-10.080183"
       y1="3.2122245"
       x2="-3.3482213"
       y2="3.8300424"
       gradientUnits="userSpaceOnUse"
       gradientTransform="matrix(0.573648,8.566211e-17,3.244811e-17,0.558837,-2.928622,-2.073324)" />
    <linearGradient
       inkscape:collect="always"
       xlink:href="#linearGradient4070"
       id="linearGradient4076"
       x1="-4.3824129"
       y1="-0.21361051"
       x2="-10.18057"
       y2="-3.1606176"
       gradientUnits="userSpaceOnUse"
       gradientTransform="matrix(0.519834,-4.429886e-2,0.100104,0.311813,24.3871,15.08224)" />
    <radialGradient
       inkscape:collect="always"
       xlink:href="#linearGradient3093"
       id="radialGradient4134"
       gradientUnits="userSpaceOnUse"
       gradientTransform="matrix(-0.383592,-1.394764,1.30726,-0.359528,8.058833,57.17202)"
       spreadMethod="reflect"
       cx="28.393408"
       cy="14.193583"
       fx="28.393408"
       fy="14.193583"
       r="13.061977" />
  </defs>
  <sodipodi:namedview
     id="base"
     pagecolor="#ffffff"
     bordercolor="#666666"
     borderopacity="1.0"
     inkscape:pageopacity="0.0"
     inkscape:pageshadow="2"
     inkscape:zoom="22.395604"
     inkscape:cx="20.824855"
     inkscape:cy="22.583091"
     inkscape:current-layer="layer1"
     showgrid="true"
     inkscape:grid-bbox="true"
     inkscape:document-units="px"
     inkscape:window-width="1280"
     inkscape:window-height="968"
     inkscape:window-x="-4"
     inkscape:window-y="-4"
     showguides="true"
     inkscape:guide-bbox="true">
    <sodipodi:guide
       orientation="horizontal"
       position="33.711973"
       id="guide4130" />
    <sodipodi:guide
       orientation="horizontal"
       position="35.096173"
       id="guide4132" />
  </sodipodi:namedview>
  <metadata
     id="metadata12147">
    <rdf:RDF>
      <cc:Work
         rdf:about="">
        <dc:format>image/svg+xml</dc:format>
        <dc:type
           rdf:resource="http://purl.org/dc/dcmitype/StillImage" />
      </cc:Work>
    </rdf:RDF>
  </metadata>
  <g
     inkscape:groupmode="layer"
     id="layer2"
     inkscape:label="unten">
    <path
       sodipodi:type="star"
       style="opacity:1;fill:#000000;fill-opacity:1;fill-rule:nonzero;stroke:#4cef31;stroke-width:1.00200903;stroke-miterlimit:4;stroke-dasharray:none;stroke-opacity:0"
       id="path4099"
       sodipodi:sides="5"
       sodipodi:cx="-15.181551"
       sodipodi:cy="-10.954858"
       sodipodi:r1="8.6268969"
       sodipodi:r2="3.5891027"
       sodipodi:arg1="0.4729066"
       sodipodi:arg2="1.1012251"
       inkscape:flatsided="false"
       inkscape:rounded="0"
       inkscape:randomized="0"
       d="M -7.5014719,-7.0255151 L -13.557468,-7.754231 L -16.545303,-2.4364349 L -17.723659,-8.4212148 L -23.704475,-9.6195257 L -18.376743,-12.589607 L -19.085256,-18.648 L -14.614181,-14.498832 L -9.071249,-17.044813 L -11.635705,-11.510405 L -7.5014719,-7.0255151 z "
       transform="matrix(0.953349,6.62816e-2,-8.166937e-2,1.039056,38.31302,20.52803)" />
  </g>
  <g
     id="layer1"
     inkscape:label="Layer 1"
     inkscape:groupmode="layer">
    <path
       sodipodi:type="arc"
       style="opacity:1;fill:url(#radialGradient4134);fill-opacity:1;fill-rule:nonzero;stroke:#000000;stroke-width:1.15897954;stroke-miterlimit:4;stroke-dasharray:none;stroke-opacity:1"
       id="path1335"
       sodipodi:cx="21.120216"
       sodipodi:cy="17.041708"
       sodipodi:rx="12.547105"
       sodipodi:ry="12.547105"
       d="M 25.270096,5.2007477 A 12.547105,12.547105 0 1 1 25.263167,5.1983216"
       sodipodi:start="5.0494808"
       sodipodi:end="11.332081"
       transform="matrix(0.85952,0,0,0.86615,-5.866523,5.869395)"
       sodipodi:open="true" />
    <path
       sodipodi:type="arc"
       style="opacity:1;fill:#b3b0b0;fill-opacity:1;fill-rule:evenodd;stroke:#000000;stroke-width:1.18048704;stroke-miterlimit:4;stroke-dasharray:none;stroke-opacity:1"
       id="path1341"
       sodipodi:cx="5.4921494"
       sodipodi:cy="-3.8552508"
       sodipodi:rx="5.0456328"
       sodipodi:ry="1.3842002"
       d="M 3.6132901,-5.1399035 A 5.0456328,1.3842002 0 1 1 3.6075911,-5.1392751"
       sodipodi:start="4.330824"
       sodipodi:end="10.612792"
       sodipodi:open="true"
       transform="matrix(0.557116,0.436843,-0.532307,0.870658,15.48182,11.96927)" />
    <path
       style="fill:#d32c2c;fill-opacity:1;fill-rule:nonzero;stroke:#000000;stroke-width:0.99999958px;stroke-linecap:butt;stroke-linejoin:miter;stroke-opacity:1"
       d="M 18.182009,8.4999998 L 14.5,14.212563"
       id="path1343" />
    <path
       style="fill:#d32c2c;fill-opacity:1;fill-rule:nonzero;stroke:#000000;stroke-width:0.9999997px;stroke-linecap:butt;stroke-linejoin:miter;stroke-opacity:1"
       d="M 24.5,12.205484 L 20.817991,17.5"
       id="path1345" />
    <path
       style="fill:url(#linearGradient4076);fill-opacity:1;fill-rule:evenodd;stroke:#000000;stroke-width:1.00000048px;stroke-linecap:butt;stroke-linejoin:miter;stroke-opacity:0"
       d="M 17.025085,16.287178 L 20.54998,17.171118 L 20.54998,17.171118 L 20.54998,17.171118 L 20.54998,17.171118 L 23.546359,13.295136 C 22.121119,13.267729 21.020804,12.945197 20.021465,12.411196 L 17.025085,16.287178 z "
       id="path4060"
       sodipodi:nodetypes="cccccccc" />
    <path
       sodipodi:type="star"
       style="opacity:1;fill:#000000;fill-opacity:1;fill-rule:nonzero;stroke:#2f2f2c;stroke-width:1;stroke-miterlimit:4;stroke-dasharray:none;stroke-opacity:0"
       id="path4081"
       sodipodi:sides="5"
       sodipodi:cx="-18.575073"
       sodipodi:cy="-8.9008837"
       sodipodi:r1="10.725687"
       sodipodi:r2="4.462276"
       sodipodi:arg1="1.6124389"
       sodipodi:arg2="2.2407574"
       inkscape:flatsided="false"
       inkscape:rounded="0"
       inkscape:randomized="0"
       d="M -19.021589,1.815505 L -21.345948,-5.4031472 L -28.904946,-6.0139995 L -22.757866,-10.455282 L -24.512769,-17.83308 L -18.389306,-13.359291 L -11.914899,-17.308169 L -14.277471,-10.101933 L -8.5211631,-5.1646754 L -16.104776,-5.1847652 L -19.021589,1.815505 z "
       transform="translate(4.404946,-1.66692)" />
    <path
       sodipodi:type="star"
       style="opacity:1;fill:#ff0007;fill-opacity:1;fill-rule:nonzero;stroke:#4cef31;stroke-width:0.99385321;stroke-miterlimit:4;stroke-dasharray:none;stroke-opacity:0"
       id="path4083"
       sodipodi:sides="5"
       sodipodi:cx="12.502454"
       sodipodi:cy="-9.5260067"
       sodipodi:r1="7.2605238"
       sodipodi:r2="3.0206418"
       sodipodi:arg1="3.0553871"
       sodipodi:arg2="3.6837056"
       inkscape:flatsided="false"
       inkscape:rounded="0"
       inkscape:randomized="0"
       d="M 5.2688912,-8.9008842 L 9.9149103,-11.084498 L 9.6726332,-16.21236 L 13.185072,-12.468507 L 17.987091,-14.283523 L 15.511879,-9.7860805 L 18.721967,-5.7799601 L 13.679762,-6.7442407 L 10.861687,-2.4533064 L 10.220645,-7.546707 L 5.2688912,-8.9008842 z "
       transform="matrix(0.971854,0,0,1.041728,12.56138,18.05568)" />
    <path
       sodipodi:type="star"
       style="opacity:1;fill:#e1c930;fill-opacity:1;fill-rule:nonzero;stroke:#4cef31;stroke-width:1.24590147;stroke-miterlimit:4;stroke-dasharray:none;stroke-opacity:0"
       id="path4097"
       sodipodi:sides="5"
       sodipodi:cx="13.663396"
       sodipodi:cy="-9.0794907"
       sodipodi:r1="5.1618509"
       sodipodi:r2="2.1475177"
       sodipodi:arg1="0.52558379"
       sodipodi:arg2="1.1539023"
       inkscape:flatsided="false"
       inkscape:rounded="0"
       inkscape:randomized="0"
       d="M 18.128558,-6.4896967 L 14.532974,-7.1159057 L 12.580166,-4.0325788 L 12.06463,-7.6456916 L 8.5287612,-8.5501216 L 11.805726,-10.156939 L 11.573247,-13.799234 L 14.114059,-11.17919 L 17.506247,-12.525822 L 15.799591,-9.2997275 L 18.128558,-6.4896967 z "
       transform="matrix(0.739695,0,0,0.870925,14.14086,16.47007)" />
  </g>
  <g
     inkscape:groupmode="layer"
     id="layer3"
     inkscape:label="oben">
    <path
       style="fill:none;fill-opacity:0.75;fill-rule:evenodd;stroke:#000000;stroke-width:0.99999946px;stroke-linecap:butt;stroke-linejoin:miter;stroke-opacity:1"
       d="M 20.919529,11.677636 C 23.979039,8.4999997 23.979039,8.4999997 23.979039,8.4999997"
       id="path3105" />
  </g>
</svg>
