<?xml version="1.0" encoding="UTF-8" standalone="no"?>
<!-- Created with Inkscape (http://www.inkscape.org/) -->
<svg
   xmlns:dc="http://purl.org/dc/elements/1.1/"
   xmlns:cc="http://web.resource.org/cc/"
   xmlns:rdf="http://www.w3.org/1999/02/22-rdf-syntax-ns#"
   xmlns:svg="http://www.w3.org/2000/svg"
   xmlns="http://www.w3.org/2000/svg"
   xmlns:sodipodi="http://inkscape.sourceforge.net/DTD/sodipodi-0.dtd"
   xmlns:inkscape="http://www.inkscape.org/namespaces/inkscape"
   width="32px"
   height="32px"
   id="svg1306"
   sodipodi:version="0.32"
   inkscape:version="0.43"
   sodipodi:docbase="G:\Medieninformatik\Multimedia II LU\SVG\graphics"
   sodipodi:docname="explosion2.svg">
  <defs
     id="defs1308" />
  <sodipodi:namedview
     id="base"
     pagecolor="#ffffff"
     bordercolor="#666666"
     borderopacity="1.0"
     inkscape:pageopacity="0.0"
     inkscape:pageshadow="2"
     inkscape:zoom="15.836083"
     inkscape:cx="12.046292"
     inkscape:cy="13.523887"
     inkscape:current-layer="layer1"
     showgrid="true"
     inkscape:grid-bbox="true"
     inkscape:document-units="px"
     inkscape:window-width="830"
     inkscape:window-height="540"
     inkscape:window-x="154"
     inkscape:window-y="203" />
  <metadata
     id="metadata1311">
    <rdf:RDF>
      <cc:Work
         rdf:about="">
        <dc:format>image/svg+xml</dc:format>
        <dc:type
           rdf:resource="http://purl.org/dc/dcmitype/StillImage" />
      </cc:Work>
    </rdf:RDF>
  </metadata>
  <g
     id="layer1"
     inkscape:label="Layer 1"
     inkscape:groupmode="layer">
    <path
       sodipodi:type="star"
       style="opacity:1;fill:#1d170e;fill-opacity:1;fill-rule:nonzero;stroke:#010000;stroke-width:3.79547644;stroke-miterlimit:4;stroke-dasharray:3.79547582, 182.18283991;stroke-dashoffset:0;stroke-opacity:0.1919643"
       id="path1314"
       sodipodi:sides="5"
       sodipodi:cx="0"
       sodipodi:cy="0.65456271"
       sodipodi:r1="20.004126"
       sodipodi:r2="8.322444"
       sodipodi:arg1="1.5752606"
       sodipodi:arg2="2.2035791"
       inkscape:flatsided="false"
       inkscape:rounded="0"
       inkscape:randomized="0"
       d="M -0.089303585,20.658489 L -4.9218187,7.3656561 L -19.052461,6.7511831 L -7.9035547,-1.9525232 L -11.685765,-15.581445 L 0.037153285,-7.6677983 L 11.830261,-15.476462 L 7.9265167,-1.8818534 L 18.997268,6.9210486 L 4.8617034,7.4093324 L -0.089303585,20.658489 z "
       transform="matrix(0.259757,0,0,0.267241,14.96722,17.664)" />
    <path
       sodipodi:type="star"
       style="opacity:1;fill:#d7b019;fill-opacity:1;fill-rule:nonzero;stroke:#010000;stroke-width:2.92693853;stroke-miterlimit:4;stroke-dasharray:2.92693785, 140.49301701;stroke-dashoffset:0;stroke-opacity:0.1919643"
       id="path2189"
       sodipodi:sides="5"
       sodipodi:cx="0"
       sodipodi:cy="0.65456271"
       sodipodi:r1="20.004126"
       sodipodi:r2="8.322444"
       sodipodi:arg1="1.5752606"
       sodipodi:arg2="2.2035791"
       inkscape:flatsided="false"
       inkscape:rounded="0"
       inkscape:randomized="0"
       d="M -0.089303585,20.658489 L -4.9218187,7.3656561 L -19.052461,6.7511831 L -7.9035547,-1.9525232 L -11.685765,-15.581445 L 0.037153285,-7.6677983 L 11.830261,-15.476462 L 7.9265167,-1.8818534 L 18.997268,6.9210486 L 4.8617034,7.4093324 L -0.089303585,20.658489 z "
       transform="matrix(0.358229,5.795043e-2,0.219576,0.361366,15.14121,19.00376)" />
    <path
       sodipodi:type="star"
       style="opacity:1;fill:#ff2e00;fill-opacity:1;fill-rule:nonzero;stroke:#010000;stroke-width:3.32131886;stroke-miterlimit:4;stroke-dasharray:3.32131858, 159.42329297;stroke-dashoffset:0;stroke-opacity:0.1919643"
       id="path2191"
       sodipodi:sides="5"
       sodipodi:cx="0"
       sodipodi:cy="0.65456271"
       sodipodi:r1="20.004126"
       sodipodi:r2="8.322444"
       sodipodi:arg1="1.5752606"
       sodipodi:arg2="2.2035791"
       inkscape:flatsided="false"
       inkscape:rounded="0"
       inkscape:randomized="0"
       d="M -0.089303585,20.658489 L -4.9218187,7.3656561 L -19.052461,6.7511831 L -7.9035547,-1.9525232 L -11.685765,-15.581445 L 0.037153285,-7.6677983 L 11.830261,-15.476462 L 7.9265167,-1.8818534 L 18.997268,6.9210486 L 4.8617034,7.4093324 L -0.089303585,20.658489 z "
       transform="matrix(0.307113,-7.029332e-2,8.271575e-2,0.276244,15.9432,18.6969)" />
  </g>
</svg>
