{
  "Manufacturer": "Hotpoint",
  "ProductPrice": 849,
  "ProductUrl": "https://www.comet.it/asciugatrici-a-pompa-di-calore/hotpoint-ariston-nt-m11-8x3sk-eu",
  "ProductName": "Hotpoint-ariston - Nt M11 8x3sk Eu",
  "ImageUri": "https://cdnakamai.comet.it/b2c/public/products/MLN00800U/b370b9416c92e941452041ce92b80e10-img-ct1-5da0aa94c92f03.76584607@450.jpg",
  "ProductId": "MLN00800U",
  "Stock": "InStock"
}