{
  "Manufacturer": "Hotpoint",
  "ProductPrice": 799,
  "ProductUrl": "https://www.comet.it/frigoriferi/hotpoint-ariston-eu-ha7ty-9721-nfx1",
  "ProductName": "Hotpoint ariston - Eu Ha7ty 9721 Nfx1",
  "ImageUri": "https://cdnakamai.comet.it/b2c/public/products/MLN00843E/d475891a5dd24e36793596a413d51efc-img-ct1-60144b27e635e7.39430302@450.jpg",
  "ProductId": "MLN00843E",
  "Stock": "InStock"
}