{
  "Manufacturer": "Hotpoint",
  "ProductPrice": 341,
  "ProductUrl": "https://www.comet.it/cucine-a-gas/hotpoint-ariston-h6tmh2af-x",
  "ProductName": "Hotpoint-ariston - H6tmh2af (x)",
  "ImageUri": "https://cdnakamai.comet.it/b2c/public/products/MLN005124/c8465f3565a0f75528bbec5323468cd2-5a72f99aa78ad0.42014855-MLN0051242@main.jpg",
  "ProductId": "MLN005124",
  "Stock": "InStock"
}