%YAML 1.1
%TAG !u! tag:unity3d.com,2011:
--- !u!319 &31900000
AvatarMask:
  m_ObjectHideFlags: 0
  m_CorrespondingSourceObject: {fileID: 0}
  m_PrefabInstance: {fileID: 0}
  m_PrefabAsset: {fileID: 0}
  m_Name: Granny_Shooting
  m_Mask: 01000000010000000100000001000000010000000100000001000000010000000100000001000000010000000100000001000000
  m_Elements:
  - m_Path: 
    m_Weight: 1
  - m_Path: Fitness_Grandma_BodyGeo
    m_Weight: 1
  - m_Path: Fitness_Grandma_BrowsAnimGeo
    m_Weight: 1
  - m_Path: Fitness_Grandma_EyesAnimGeo
    m_Weight: 1
  - m_Path: Fitness_Grandma_MouthAnimGeo
    m_Weight: 1
  - m_Path: Hips
    m_Weight: 1
  - m_Path: Hips/FitGrandmaFacialAnim_Joint
    m_Weight: 1
  - m_Path: Hips/Pelvis
    m_Weight: 1
  - m_Path: Hips/Pelvis/LeftUpLeg
    m_Weight: 1
  - m_Path: Hips/Pelvis/LeftUpLeg/Left_Butt
    m_Weight: 1
  - m_Path: Hips/Pelvis/LeftUpLeg/LeftLeg
    m_Weight: 1
  - m_Path: Hips/Pelvis/LeftUpLeg/LeftLeg/LeftFoot
    m_Weight: 1
  - m_Path: Hips/Pelvis/LeftUpLeg/LeftLeg/LeftFoot/LeftToeBase
    m_Weight: 1
  - m_Path: Hips/Pelvis/LeftUpLeg/LeftLeg/LeftPantLeg
    m_Weight: 1
  - m_Path: Hips/Pelvis/RightUpLeg
    m_Weight: 1
  - m_Path: Hips/Pelvis/RightUpLeg/Right_Butt
    m_Weight: 1
  - m_Path: Hips/Pelvis/RightUpLeg/RightLeg
    m_Weight: 1
  - m_Path: Hips/Pelvis/RightUpLeg/RightLeg/RightFoot
    m_Weight: 1
  - m_Path: Hips/Pelvis/RightUpLeg/RightLeg/RightFoot/RightToeBase
    m_Weight: 1
  - m_Path: Hips/Pelvis/RightUpLeg/RightLeg/RightPantLeg
    m_Weight: 1
  - m_Path: Hips/Spine
    m_Weight: 1
  - m_Path: Hips/Spine/Belly
    m_Weight: 1
  - m_Path: Hips/Spine/Spine1
    m_Weight: 1
  - m_Path: Hips/Spine/Spine1/Spine2
    m_Weight: 1
  - m_Path: Hips/Spine/Spine1/Spine2/Hood
    m_Weight: 1
  - m_Path: Hips/Spine/Spine1/Spine2/Hood/Hood1
    m_Weight: 1
  - m_Path: Hips/Spine/Spine1/Spine2/Hood/Hood1/Hood2
    m_Weight: 1
  - m_Path: Hips/Spine/Spine1/Spine2/Left_Breast
    m_Weight: 1
  - m_Path: Hips/Spine/Spine1/Spine2/LeftShoulder
    m_Weight: 1
  - m_Path: Hips/Spine/Spine1/Spine2/LeftShoulder/LeftArm
    m_Weight: 1
  - m_Path: Hips/Spine/Spine1/Spine2/LeftShoulder/LeftArm/LeftForeArm
    m_Weight: 1
  - m_Path: Hips/Spine/Spine1/Spine2/LeftShoulder/LeftArm/LeftForeArm/LeftHand
    m_Weight: 1
  - m_Path: Hips/Spine/Spine1/Spine2/LeftShoulder/LeftArm/LeftForeArm/LeftHand/LeftHandIndex1
    m_Weight: 1
  - m_Path: Hips/Spine/Spine1/Spine2/LeftShoulder/LeftArm/LeftForeArm/LeftHand/LeftHandIndex1/LeftHandIndex2
    m_Weight: 1
  - m_Path: Hips/Spine/Spine1/Spine2/LeftShoulder/LeftArm/LeftForeArm/LeftHand/LeftHandIndex1/LeftHandIndex2/LeftHandIndex3
    m_Weight: 1
  - m_Path: Hips/Spine/Spine1/Spine2/LeftShoulder/LeftArm/LeftForeArm/LeftHand/LeftHandMiddle1
    m_Weight: 1
  - m_Path: Hips/Spine/Spine1/Spine2/LeftShoulder/LeftArm/LeftForeArm/LeftHand/LeftHandMiddle1/LeftHandMiddle2
    m_Weight: 1
  - m_Path: Hips/Spine/Spine1/Spine2/LeftShoulder/LeftArm/LeftForeArm/LeftHand/LeftHandMiddle1/LeftHandMiddle2/LeftHandMiddle3
    m_Weight: 1
  - m_Path: Hips/Spine/Spine1/Spine2/LeftShoulder/LeftArm/LeftForeArm/LeftHand/LeftHandPinky1
    m_Weight: 1
  - m_Path: Hips/Spine/Spine1/Spine2/LeftShoulder/LeftArm/LeftForeArm/LeftHand/LeftHandPinky1/LeftHandPinky2
    m_Weight: 1
  - m_Path: Hips/Spine/Spine1/Spine2/LeftShoulder/LeftArm/LeftForeArm/LeftHand/LeftHandPinky1/LeftHandPinky2/LeftHandPinky3
    m_Weight: 1
  - m_Path: Hips/Spine/Spine1/Spine2/LeftShoulder/LeftArm/LeftForeArm/LeftHand/LeftHandRing1
    m_Weight: 1
  - m_Path: Hips/Spine/Spine1/Spine2/LeftShoulder/LeftArm/LeftForeArm/LeftHand/LeftHandRing1/LeftHandRing2
    m_Weight: 1
  - m_Path: Hips/Spine/Spine1/Spine2/LeftShoulder/LeftArm/LeftForeArm/LeftHand/LeftHandRing1/LeftHandRing2/LeftHandRing3
    m_Weight: 1
  - m_Path: Hips/Spine/Spine1/Spine2/LeftShoulder/LeftArm/LeftForeArm/LeftHand/LeftHandThumb1
    m_Weight: 1
  - m_Path: Hips/Spine/Spine1/Spine2/LeftShoulder/LeftArm/LeftForeArm/LeftHand/LeftHandThumb1/LeftHandThumb2
    m_Weight: 1
  - m_Path: Hips/Spine/Spine1/Spine2/LeftShoulder/LeftArm/LeftForeArm/LeftHand/LeftHandThumb1/LeftHandThumb2/LeftHandThumb3
    m_Weight: 1
  - m_Path: Hips/Spine/Spine1/Spine2/LeftShoulder/LeftArm/LeftForeArm/LeftSleeve
    m_Weight: 1
  - m_Path: Hips/Spine/Spine1/Spine2/Neck
    m_Weight: 1
  - m_Path: Hips/Spine/Spine1/Spine2/Neck/Head
    m_Weight: 1
  - m_Path: Hips/Spine/Spine1/Spine2/Neck/Head/HairLeftA
    m_Weight: 1
  - m_Path: Hips/Spine/Spine1/Spine2/Neck/Head/HairLeftB
    m_Weight: 1
  - m_Path: Hips/Spine/Spine1/Spine2/Neck/Head/HairLeftC
    m_Weight: 1
  - m_Path: Hips/Spine/Spine1/Spine2/Neck/Head/HairLeftD
    m_Weight: 1
  - m_Path: Hips/Spine/Spine1/Spine2/Neck/Head/HairLeftE
    m_Weight: 1
  - m_Path: Hips/Spine/Spine1/Spine2/Neck/Head/HairLeftF
    m_Weight: 1
  - m_Path: Hips/Spine/Spine1/Spine2/Neck/Head/HairMidA
    m_Weight: 1
  - m_Path: Hips/Spine/Spine1/Spine2/Neck/Head/HairMidB
    m_Weight: 1
  - m_Path: Hips/Spine/Spine1/Spine2/Neck/Head/HairMidC
    m_Weight: 1
  - m_Path: Hips/Spine/Spine1/Spine2/Neck/Head/HairMidD
    m_Weight: 1
  - m_Path: Hips/Spine/Spine1/Spine2/Neck/Head/HairMidE
    m_Weight: 1
  - m_Path: Hips/Spine/Spine1/Spine2/Neck/Head/HairMidF
    m_Weight: 1
  - m_Path: Hips/Spine/Spine1/Spine2/Neck/Head/HairRightA
    m_Weight: 1
  - m_Path: Hips/Spine/Spine1/Spine2/Neck/Head/HairRightB
    m_Weight: 1
  - m_Path: Hips/Spine/Spine1/Spine2/Neck/Head/HairRightC
    m_Weight: 1
  - m_Path: Hips/Spine/Spine1/Spine2/Neck/Head/HairRightD
    m_Weight: 1
  - m_Path: Hips/Spine/Spine1/Spine2/Neck/Head/HairRightE
    m_Weight: 1
  - m_Path: Hips/Spine/Spine1/Spine2/Neck/Head/HairRightF
    m_Weight: 1
  - m_Path: Hips/Spine/Spine1/Spine2/Neck/Head/Visor
    m_Weight: 1
  - m_Path: Hips/Spine/Spine1/Spine2/Right_Breast
    m_Weight: 1
  - m_Path: Hips/Spine/Spine1/Spine2/RightShoulder
    m_Weight: 1
  - m_Path: Hips/Spine/Spine1/Spine2/RightShoulder/RightArm
    m_Weight: 1
  - m_Path: Hips/Spine/Spine1/Spine2/RightShoulder/RightArm/RightForeArm
    m_Weight: 1
  - m_Path: Hips/Spine/Spine1/Spine2/RightShoulder/RightArm/RightForeArm/RightHand
    m_Weight: 1
  - m_Path: Hips/Spine/Spine1/Spine2/RightShoulder/RightArm/RightForeArm/RightHand/RightHandIndex1
    m_Weight: 1
  - m_Path: Hips/Spine/Spine1/Spine2/RightShoulder/RightArm/RightForeArm/RightHand/RightHandIndex1/RightHandIndex2
    m_Weight: 1
  - m_Path: Hips/Spine/Spine1/Spine2/RightShoulder/RightArm/RightForeArm/RightHand/RightHandIndex1/RightHandIndex2/RightHandIndex3
    m_Weight: 1
  - m_Path: Hips/Spine/Spine1/Spine2/RightShoulder/RightArm/RightForeArm/RightHand/RightHandMiddle1
    m_Weight: 1
  - m_Path: Hips/Spine/Spine1/Spine2/RightShoulder/RightArm/RightForeArm/RightHand/RightHandMiddle1/RightHandMiddle2
    m_Weight: 1
  - m_Path: Hips/Spine/Spine1/Spine2/RightShoulder/RightArm/RightForeArm/RightHand/RightHandMiddle1/RightHandMiddle2/RightHandMiddle3
    m_Weight: 1
  - m_Path: Hips/Spine/Spine1/Spine2/RightShoulder/RightArm/RightForeArm/RightHand/RightHandPinky1
    m_Weight: 1
  - m_Path: Hips/Spine/Spine1/Spine2/RightShoulder/RightArm/RightForeArm/RightHand/RightHandPinky1/RightHandPinky2
    m_Weight: 1
  - m_Path: Hips/Spine/Spine1/Spine2/RightShoulder/RightArm/RightForeArm/RightHand/RightHandPinky1/RightHandPinky2/RightHandPinky3
    m_Weight: 1
  - m_Path: Hips/Spine/Spine1/Spine2/RightShoulder/RightArm/RightForeArm/RightHand/RightHandRing1
    m_Weight: 1
  - m_Path: Hips/Spine/Spine1/Spine2/RightShoulder/RightArm/RightForeArm/RightHand/RightHandRing1/RightHandRing2
    m_Weight: 1
  - m_Path: Hips/Spine/Spine1/Spine2/RightShoulder/RightArm/RightForeArm/RightHand/RightHandRing1/RightHandRing2/RightHandRing3
    m_Weight: 1
  - m_Path: Hips/Spine/Spine1/Spine2/RightShoulder/RightArm/RightForeArm/RightHand/RightHandThumb1
    m_Weight: 1
  - m_Path: Hips/Spine/Spine1/Spine2/RightShoulder/RightArm/RightForeArm/RightHand/RightHandThumb1/RightHandThumb2
    m_Weight: 1
  - m_Path: Hips/Spine/Spine1/Spine2/RightShoulder/RightArm/RightForeArm/RightHand/RightHandThumb1/RightHandThumb2/RightHandThumb3
    m_Weight: 1
  - m_Path: Hips/Spine/Spine1/Spine2/RightShoulder/RightArm/RightForeArm/RightSleeve
    m_Weight: 1
  - m_Path: Hips/Spine/Spine1/Spine2/Whistle
    m_Weight: 1
  - m_Path: Hips/Spine/Spine1/Spine2/Whistle/Whistle1
    m_Weight: 1
  - m_Path: Hips/Spine/Spine1/Spine2/Whistle/Whistle1/Whistle2
    m_Weight: 1
