{
    "name": "ZombieControls",
    "maps": [
        {
            "name": "Default",
            "id": "fb9e49d2-87a4-4623-9fb9-7b1b4a8c5836",
            "actions": [
                {
                    "name": "Enter",
                    "type": "Button",
                    "id": "a0ce0ee9-6eb4-4073-ad99-1fdbccd6e74b",
                    "expectedControlType": "Button",
                    "processors": "",
                    "interactions": "",
                    "initialStateCheck": false
                }
            ],
            "bindings": [
                {
                    "name": "",
                    "id": "26182d4b-eaf7-4d85-b11f-209cc1345d52",
                    "path": "<Keyboard>/enter",
                    "interactions": "",
                    "processors": "",
                    "groups": "",
                    "action": "Enter",
                    "isComposite": false,
                    "isPartOfComposite": false
                }
            ]
        }
    ],
    "controlSchemes": []
}