<svg width="119" height="119" viewBox="0 0 119 119" fill="none" xmlns="http://www.w3.org/2000/svg">
<rect width="119" height="119" fill="white"/>
<path d="M29.51 0H0V5.71H29.51V0Z" fill="#6EC6DE"/>
<path d="M74.18 0H44.67V5.71H74.18V0Z" fill="#1DA3CA"/>
<path d="M118.85 0H89.34V5.71H118.85V0Z" fill="#1C6EA5"/>
<path d="M74.18 20.99H44.67V26.7H74.18V20.99Z" fill="#1DA3CA"/>
<path d="M118.85 20.99H89.34V26.7H118.85V20.99Z" fill="#1C6EA5"/>
<path d="M118.85 41.99H89.34V47.7H118.85V41.99Z" fill="#1C6EA5"/>
<path d="M29.51 71.92V73.92H15.74L15.68 118.8H13.68L13.74 73.96H0V71.96L29.51 71.92ZM74.18 73.92V71.92H43.66V118.8H45.66V94.91H74.17V92.91H45.66V73.91L74.18 73.92ZM118.85 73.92V71.92H88.33V118.8H118.84V116.8H90.33V94.91H118.84V92.91H90.33V73.91L118.85 73.92Z" fill="url(#paint0_linear)"/>
<defs>
<linearGradient id="paint0_linear" x1="0" y1="95.37" x2="118.84" y2="95.37" gradientUnits="userSpaceOnUse">
<stop stop-color="#6EC6DE"/>
<stop offset="0.51" stop-color="#1DA3CA"/>
<stop offset="1" stop-color="#1C6EA5"/>
</linearGradient>
</defs>
</svg>
