<?xml version="1.0" encoding="UTF-8"?>
<svg width="513px" height="513px" viewBox="0 0 513 513" version="1.1" xmlns="http://www.w3.org/2000/svg" xmlns:xlink="http://www.w3.org/1999/xlink">
    <title>logo-square@1,5x</title>
    <g id="logo-square" stroke="none" stroke-width="1" fill="none" fill-rule="evenodd">
        <rect fill="#000000" x="0" y="0" width="513" height="513"></rect>
        <rect id="Rectangle" stroke="#979797" fill="#D8D8D8" x="21" y="28" width="471" height="464"></rect>
        <path d="M21,300.802248 L83.1203718,258.481961 C102.046086,239.69347 116.256323,225.586299 125.751084,216.16045 C135.245845,206.7346 135.373875,206.607567 126.135174,215.779351 L147.06644,195 L210.987859,258.481961 L248.617733,298.935893 L253.618571,300.802248 L256.555759,307.060317 L296.224634,343.099289 L338.855346,385.419577 L381.486058,427.716618 L448,503 L21,503 L21,300.802248 Z" id="Path-2" fill="#877E6F"></path>
        <polygon id="Path-3" fill="#819C58" points="22.542802 439.17995 84.4388544 382.853794 148.154011 318 169.392396 339.610013 211.844606 382.853794 254.308194 426.073195 318 503 21 503"></polygon>
        <path d="M343,232 C359.581622,232 373.725007,224.511169 384.85,213.9084 C396.698524,202.616064 405,187.660033 405,170 C405,153.119516 395.793287,139.330257 384.85,128.15 C373.595093,116.651375 360.361171,108 343,108 C325.395142,108 310.35275,116.366335 299.0668,128.15 C288.401446,139.285701 281,153.363204 281,170 C281,204.241654 308.758346,232 343,232 Z" id="Oval" fill="#EEEA41"></path>
        <g id="pixelpoetry" transform="translate(-3.000000, -3.000000)" fill="#000000" fill-rule="nonzero">
            <path d="M473.223753,3 L3,3 L3,216.79069 L3.02413844,259.500618 L3.02413844,516 L516,516 L516,302.258756 L515.975862,259.500618 L515.975862,3 L473.223753,3 Z M473.223753,88.491553 L473.223753,473.240626 L430.495746,473.240626 L430.495746,430.482488 L387.743638,430.482488 L387.743638,473.240626 L302.26414,473.240626 L302.26414,430.482488 L259.512032,430.482488 L259.512032,473.240626 L45.7514904,473.240626 L45.7514904,430.482488 L88.5035987,430.482488 L88.5035987,387.748455 L45.7514904,387.748455 L45.7514904,302.256902 L88.5035987,302.256902 L88.5277372,259.498764 L45.7756288,259.498764 L45.7756288,45.7080742 L473.247274,45.7080742 L473.223753,88.491553 Z" id="Shape"></path>
            <polygon id="Path" points="388 132 388 88 303 88 303 132"></polygon>
            <polygon id="Path" points="303 216 303 260 388 260 388 216"></polygon>
            <polygon id="Path" points="303 131 259 131 259 216 303 216"></polygon>
            <polygon id="Path" points="387 173.48771 387 216 431 216 431 131 387 131"></polygon>
            <polygon id="Path" points="216 387 260 387 260 431 216 431"></polygon>
            <polygon id="Path" points="174 345 218 345 218 389 174 389"></polygon>
            <polygon id="Path" points="130 301 174 301 174 345 130 345"></polygon>
            <polygon id="Path" points="88 345 132 345 132 389 88 389"></polygon>
            <polygon id="Path" points="345 387 389 387 389 431 345 431"></polygon>
            <polygon id="Path" points="301 345 345 345 345 389 301 389"></polygon>
            <polygon id="Path" points="259 301 303 301 303 345 259 345"></polygon>
            <polygon id="Path" points="216 259 260 259 260 303 216 303"></polygon>
            <polygon id="Path" points="174 216 218 216 218 260 174 260"></polygon>
            <polygon id="Path" points="130 174 174 174 174 218 130 218"></polygon>
            <polygon id="Path" points="88 216 132 216 132 260 88 260"></polygon>
        </g>
    </g>
</svg>