%YAML 1.1
%TAG !u! tag:unity3d.com,2011:
--- !u!114 &11400000
MonoBehaviour:
  m_ObjectHideFlags: 0
  m_CorrespondingSourceObject: {fileID: 0}
  m_PrefabInstance: {fileID: 0}
  m_PrefabAsset: {fileID: 0}
  m_GameObject: {fileID: 0}
  m_Enabled: 1
  m_EditorHideFlags: 0
  m_Script: {fileID: 11500000, guid: 89608d9fd4d6e7249a9e16ce76345283, type: 3}
  m_Name: GunData
  m_EditorClassIdentifier: 
  descName: Wrench
  canShot: 0
  gunMesh: {fileID: 347675349536265083, guid: e0800bd05bd7f2b4da6789a156f9ccff, type: 3}
  gunMeshMaterial: {fileID: -7749679436673675423, guid: e0800bd05bd7f2b4da6789a156f9ccff,
    type: 3}
  icon: {fileID: 21300000, guid: 5ecdedbd2cd2582478b24470b846be29, type: 3}
  timeBetweenShots: 0
  shootForce: 0
  spread: 0
  reloadTime: 0
  timeBetweenShooting: 0
  magazineSize: 0
  bulletsPerTap: 0
  damagePerBullet: 0
  recoilForce: 0
  allowButtonHold: 0
  shootPoint: {x: 0, y: 0, z: 0}
  damagePerHit: 10
  timeBetweenHit: 0
  mass: 20
  ammoUsed: None
