%YAML 1.1
%TAG !u! tag:unity3d.com,2011:
--- !u!114 &11400000
MonoBehaviour:
  m_ObjectHideFlags: 0
  m_CorrespondingSourceObject: {fileID: 0}
  m_PrefabInstance: {fileID: 0}
  m_PrefabAsset: {fileID: 0}
  m_GameObject: {fileID: 0}
  m_Enabled: 1
  m_EditorHideFlags: 0
  m_Script: {fileID: 11500000, guid: 19664f3e543826845acf1313d909f57d, type: 3}
  m_Name: MedKit_Shop
  m_EditorClassIdentifier: 
  name: Medkit
  chance: 10
  price: 20
  itemType: 
  image: {fileID: -8066109314204623117, guid: d2c6048e4cd003d4cb14e21156fac9f1, type: 3}
  effects:
  - effect: HP
    effectValue: 50
  - effect: 
    effectValue: 0
