%YAML 1.1
%TAG !u! tag:unity3d.com,2011:
--- !u!114 &11400000
MonoBehaviour:
  m_ObjectHideFlags: 0
  m_CorrespondingSourceObject: {fileID: 0}
  m_PrefabInstance: {fileID: 0}
  m_PrefabAsset: {fileID: 0}
  m_GameObject: {fileID: 0}
  m_Enabled: 1
  m_EditorHideFlags: 0
  m_Script: {fileID: 11500000, guid: b873e821a33cc684bb6c7393cceae104, type: 3}
  m_Name: Alcohol
  m_EditorClassIdentifier: 
  name: Alcohol
  mesh: {fileID: -5324487738348047071, guid: 62477faf4311da041bed451a20162550, type: 3}
  meshMat: {fileID: 5561349426305759274, guid: 4bccab6d0aac7da459c5f0f2c3f08975, type: 3}
  isKey: 0
  DamagePlayer: 1
  textDead: You drunk too much for today... take a nap and turn back later :)
