%YAML 1.1
%TAG !u! tag:unity3d.com,2011:
--- !u!114 &11400000
MonoBehaviour:
  m_ObjectHideFlags: 0
  m_CorrespondingSourceObject: {fileID: 0}
  m_PrefabInstance: {fileID: 0}
  m_PrefabAsset: {fileID: 0}
  m_GameObject: {fileID: 0}
  m_Enabled: 1
  m_EditorHideFlags: 0
  m_Script: {fileID: 11500000, guid: b873e821a33cc684bb6c7393cceae104, type: 3}
  m_Name: Apple_01
  m_EditorClassIdentifier: 
  name: Apple_01
  mesh: {fileID: -7225111000082610547, guid: b16c5ddf5694d954382784f147b96e7c, type: 3}
  meshMat: {fileID: 5561349426305759274, guid: 410663d38906acc4dba6eb18cd4e8122, type: 3}
