%YAML 1.1
%TAG !u! tag:unity3d.com,2011:
--- !u!21 &2100000
Material:
  serializedVersion: 6
  m_ObjectHideFlags: 0
  m_CorrespondingSourceObject: {fileID: 0}
  m_PrefabInstance: {fileID: 0}
  m_PrefabAsset: {fileID: 0}
  m_Name: fire Agnot
  m_Shader: {fileID: 4800000, guid: c50293bb9fcfe4b1ab89791c71a06f19, type: 3}
  m_ShaderKeywords: ETC1_EXTERNAL_ALPHA SHAPEX_ON
  m_LightmapFlags: 4
  m_EnableInstancingVariants: 0
  m_DoubleSidedGI: 0
  m_CustomRenderQueue: -1
  stringTagMap: {}
  disabledShaderPasses: []
  m_SavedProperties:
    serializedVersion: 3
    m_TexEnvs:
    - _BumpMap:
        m_Texture: {fileID: 0}
        m_Scale: {x: 1, y: 1}
        m_Offset: {x: 0, y: 0}
    - _DetailAlbedoMap:
        m_Texture: {fileID: 0}
        m_Scale: {x: 1, y: 1}
        m_Offset: {x: 0, y: 0}
    - _DetailMask:
        m_Texture: {fileID: 0}
        m_Scale: {x: 1, y: 1}
        m_Offset: {x: 0, y: 0}
    - _DetailNormalMap:
        m_Texture: {fileID: 0}
        m_Scale: {x: 1, y: 1}
        m_Offset: {x: 0, y: 0}
    - _DistortTex:
        m_Texture: {fileID: 2800000, guid: 2c6fa64d250b1435685ad16b821bc5d8, type: 3}
        m_Scale: {x: 0.97, y: 0.33}
        m_Offset: {x: 0, y: 0.3}
    - _EmissionMap:
        m_Texture: {fileID: 0}
        m_Scale: {x: 1, y: 1}
        m_Offset: {x: 0, y: 0}
    - _MainTex:
        m_Texture: {fileID: 0}
        m_Scale: {x: 1, y: 1}
        m_Offset: {x: 0, y: 0}
    - _MetallicGlossMap:
        m_Texture: {fileID: 0}
        m_Scale: {x: 1, y: 1}
        m_Offset: {x: 0, y: 0}
    - _NoiseTex:
        m_Texture: {fileID: 2800000, guid: 1fbcfed06befb40cdbb8076a5eb1d15c, type: 3}
        m_Scale: {x: 1.2, y: 1}
        m_Offset: {x: -0.11, y: 0}
    - _OcclusionMap:
        m_Texture: {fileID: 0}
        m_Scale: {x: 1, y: 1}
        m_Offset: {x: 0, y: 0}
    - _ParallaxMap:
        m_Texture: {fileID: 0}
        m_Scale: {x: 1, y: 1}
        m_Offset: {x: 0, y: 0}
    - _ShapeTex:
        m_Texture: {fileID: 2800000, guid: fbbdd202a65d24ed1ae193038637abe5, type: 3}
        m_Scale: {x: 1, y: 1}
        m_Offset: {x: 0, y: 0}
    m_Floats:
    - SHAPE: 0
    - SHAPEX: 1
    - _BumpScale: 1
    - _Cutoff: 0.5
    - _DetailNormalMapScale: 1
    - _Distort: 0.16
    - _DstBlend: 0
    - _Edge: 0.4
    - _GlossMapScale: 1
    - _Glossiness: 0.5
    - _GlossyReflections: 1
    - _Hard: 40
    - _Height: 0.8
    - _Metallic: 0
    - _Mode: 0
    - _OcclusionStrength: 1
    - _Offset: -0.88
    - _Parallax: 0.02
    - _ScrollX: -1.3
    - _ScrollY: -1.8
    - _SmoothnessTextureChannel: 0
    - _SpecularHighlights: 1
    - _SrcBlend: 1
    - _UVSec: 0
    - _ZWrite: 1
    m_Colors:
    - _Color: {r: 1, g: 1, b: 1, a: 1}
    - _ColorA: {r: 0.862069, g: 1, b: 0, a: 1}
    - _ColorB: {r: 0, g: 0, b: 0.9882353, a: 1}
    - _EmissionColor: {r: 0, g: 0, b: 0, a: 1}
    - _TintA: {r: 0.047058824, g: 0.19215687, b: 1, a: 1}
    - _TintB: {r: 0.9882353, g: 0.3529412, b: 0.19607843, a: 1}
