{
  "search_parameter_keys": [
    "theta_jn",
    "psi",
    "luminosity_distance",
    "chirp_mass",
    "reduced_mass",
    "dec",
    "ra",
    "geocent_time",
    "a_1",
    "a_2",
    "tilt_1",
    "tilt_2",
    "phi_12",
    "phi_jl",
    "lambda_1",
    "lambda_2"
  ],
  "trajectory_functions": {
      "theta_jn": "cosine",
      "psi": "None",
      "luminosity_distance": "log",
      "chirp_mass": "log",
      "reduced_mass": "log",
      "dec": "sine",
      "ra": "None",
      "geocent_time": "log"
  },
  "search_parameter_keys_local_fit": [
    "theta_jn",
    "psi",
    "luminosity_distance"
  ],
  "parameters_offsets": {
      "theta_jn": 1e-7,
      "phase": 1e-7,
      "psi": 1e-7,
      "luminosity_distance": 1e-7,
      "chirp_mass": 1e-7,
      "reduced_mass": 1e-7,
      "dec": 1e-7,
      "ra": 1e-7,
      "geocent_time": 1e-7
  }
}
