timeStamp,elapsed,label,responseCode,responseMessage,threadName,dataType,success,failureMessage,bytes,sentBytes,grpThreads,allThreads,Latency,IdleTime,Connect
1522222198308,28600,Log in,200,OK,Performance Monitoring 1-1,text,true,,340103,886,1,1,10851,0,321
1522222226973,8764,Homepage Load Time ,200,OK,Performance Monitoring 1-1,text,true,,338744,291,1,1,550,0,262
1522222235756,7994,Get Notif Filters,200,OK,Performance Monitoring 1-1,text,true,,40197,216,1,1,7229,0,385
