timeStamp,elapsed,label,responseCode,responseMessage,threadName,dataType,success,failureMessage,bytes,sentBytes,grpThreads,allThreads,Latency,IdleTime,Connect
1522139030258,26492,Log in,200,OK,Performance Monitoring 1-1,text,true,,339773,886,1,1,12592,0,322
1522139056816,5751,Homepage Load Time ,200,OK,Performance Monitoring 1-1,text,true,,338658,291,1,1,558,0,263
1522139062584,8371,Get Notif Filters,200,OK,Performance Monitoring 1-1,text,true,,40197,216,1,1,7590,0,265
