timeStamp,elapsed,label,responseCode,responseMessage,threadName,dataType,success,failureMessage,bytes,sentBytes,grpThreads,allThreads,Latency,IdleTime,Connect
1522220073497,24908,Log in,200,OK,Performance Monitoring 1-1,text,true,,339839,886,1,1,8653,0,342
1522220098472,12988,Homepage Load Time ,200,OK,Performance Monitoring 1-1,text,true,,338409,291,1,1,594,0,294
1522220111479,10428,Get Notif Filters,200,OK,Performance Monitoring 1-1,text,true,,40197,216,1,1,7610,0,288
