timeStamp,elapsed,label,responseCode,responseMessage,threadName,dataType,success,failureMessage,bytes,sentBytes,grpThreads,allThreads,Latency,IdleTime,Connect
1522207130780,22505,Log in,200,OK,Performance Monitoring 1-1,text,true,,340022,886,1,1,7168,0,412
1522207153357,8442,Homepage Load Time ,200,OK,Performance Monitoring 1-1,text,true,,338524,291,1,1,544,0,260
1522207161820,9200,Get Notif Filters,200,OK,Performance Monitoring 1-1,text,true,,40197,216,1,1,8363,0,286
