timeStamp,elapsed,label,responseCode,responseMessage,threadName,dataType,success,failureMessage,bytes,sentBytes,grpThreads,allThreads,Latency,IdleTime,Connect
1522208151298,19916,Log in,200,OK,Performance Monitoring 1-1,text,true,,340006,886,1,1,7199,0,350
1522208171282,6910,Homepage Load Time ,200,OK,Performance Monitoring 1-1,text,true,,338516,291,1,1,673,0,358
1522208178210,8328,Get Notif Filters,200,OK,Performance Monitoring 1-1,text,true,,40197,216,1,1,7561,0,265
