501159 859859 525
669539 979976 525
611196 733021 509
704009 896456 525
644426 838392 525
914864 522068 525
74547 483231 449
773092 416506 509
573354 252593 470
346712 398708 436
251399 217749 443
348289 205084 443
166640 203731 365
886558 922678 476
77106 902070 525
825921 377625 509
453727 57056 449
998066 893486 507
254970 826792 509
724115 282193 509
793751 808068 468
83189 121315 354
611595 75938 470
495860 41515 449
267591 829610 509
116052 879896 525
791912 551986 509
773979 370659 509
240893 262011 363
277511 191524 443
902693 202696 525
543211 298285 470
677093 797800 504
899549 744823 525
283231 426222 449
265605 104056 443
645550 51829 509
424437 867084 525
549805 430099 470
242812 69792 443
553412 331301 470
102596 125563 354
512728 690276 509
99648 591158 470
887909 185631 525
518008 757982 509
184273 321787 443
984006 307020 525
694917 727619 504
217281 773451 509
862498 159633 525
252563 284548 407
925718 69334 525
578525 534222 452
920344 726618 525
364092 442049 449
105383 278709 443
58262 11482 340
280465 418523 449
942118 79455 525
648394 580029 509
239765 677506 509
430659 326072 449
289747 429941 449
61873 499953 449
216056 555462 470
623256 141364 470
657442 485171 509
34235 91728 351
720167 161458 509
492491 600365 470
287055 554663 470
640058 698735 442
899539 514255 525
376094 237415 441
845867 836183 525
174799 849764 525
704420 673068 442
646559 726629 504
837319 654726 504
712211 173672 509
316442 425619 449
184877 511772 449
681057 681109 336
264563 486456 449
690312 811814 504
289558 410404 449
171277 285792 443
426428 453894 400
774677 414173 509
586489 687456 509
860359 52071 525
565666 235879 470
87229 540278 470
975660 936774 507
309364 135375 443
230027 686120 509
748533 373787 509
899008 456214 525
710521 607573 509
349359 378991 423
428411 662378 509
225830 924876 525
970417 443913 525
650112 297620 509
804968 348951 509
481696 627375 509
410550 334773 449
877185 569401 525
757288 212739 509
948590 774046 525
646992 48218 509
103891 977988 525
20836 733545 509
376942 69770 443
224286 113165 386
677004 71358 509
314465 885765 525
540176 475718 470
225058 333070 443
103869 721128 509
585986 501603 470
178005 48155 383
88520 582432 470
370076 788381 509
863315 560752 525
360039 519094 470
66017 143628 375
544962 245201 470
120613 63990 354
672688 505589 509
650384 536523 509
926042 200844 525
876514 573145 525
786158 94583 509
409573 791039 509
779447 953143 525
620629 137903 470
323053 556724 470
542761 231249 470
585685 491961 470
515728 819117 509
513034 153750 470
677574 175547 509
924561 216051 525
933601 62459 525
313212 489915 449
77337 313091 443
889439 42081 525
657406 5176 509
607460 66009 470
103888 295506 443
648992 409641 509
574466 161778 470
527393 262299 470
384708 509490 449
429181 770906 509
369964 78738 443
205374 765944 509
156799 909910 525
650574 509566 509
301942 847265 525
804833 297853 509
927762 368812 525
5084 419627 449
887938 584219 525
413388 377804 449
514352 504616 470
737669 560225 509
112557 590456 470
769898 683556 504
854339 279921 525
881700 240563 525
14202 777065 509
603906 546588 452
351638 700852 509
16352 714993 509
636581 619308 509
984348 926671 507
39315 960616 525
519922 853362 525
251256 632824 509
68988 52169 340
646907 59245 509
842360 799592 525
580220 782753 509
14116 337457 443
596249 134428 470
408126 519715 470
66166 745192 509
619670 146713 470
463948 471362 413
16328 161428 383
173762 392624 443
740293 410668 509
4504 137788 354
128508 491629 449
361648 527794 470
923306 37359 525
772678 478156 509
854480 95534 525
612573 261408 470
616863 572654 447
506656 828808 509
696846 196218 509
783200 418458 509
37530 817645 509
959856 409547 525
491099 488366 351
534783 599978 452
658553 783444 504
311642 42604 443
229826 919502 525
844794 810478 525
934382 367000 525
703400 670060 442
890791 650003 525
864393 905254 445
389223 108944 443
235762 878172 525
178332 490479 449
45795 509065 449
92771 226188 386
896339 385029 525
799253 648394 504
318599 93142 443
69167 29063 340
958263 727926 525
915209 864294 476
183512 544988 470
766167 979936 525
491785 640696 509
208303 715793 509
844814 897628 445
948825 982285 458
20241 100674 351
758535 228613 509
774715 998468 525
