182292 310166 443
358893 424809 449
720072 531116 509
850621 370233 525
9959 769463 509
696966 765625 504
626576 648122 416
155257 935822 525
36529 807070 509
155002 851600 525
570716 215887 470
635900 425278 509
403135 13629 443
908146 761491 525
976835 773827 525
905766 775131 525
333229 491972 449
525674 905361 525
999727 406014 525
943849 557982 525
972643 465991 525
387904 404322 436
377077 344649 441
154298 959882 525
688736 165955 509
14919 188096 383
994247 327660 525
617791 732244 509
37582 140724 354
731016 703312 504
17211 340618 443
668293 250825 509
900883 87579 525
823709 981673 525
325659 586834 470
574311 380197 470
636851 427597 509
565360 765377 509
980199 439609 525
13880 651723 509
5549 25054 282
232638 365012 441
967603 194182 525
55703 865587 525
501545 316966 449
197733 471509 449
317294 759859 509
378672 157033 443
2934 75266 340
521129 946326 525
672710 655911 442
196161 94280 383
33690 87482 351
852545 255641 525
81537 25319 351
522271 884978 525
431540 624094 470
583351 369216 470
355890 116030 443
919438 93968 525
745928 339183 509
626305 709593 509
900128 585499 525
318129 91303 443
447372 699028 509
632903 473219 509
535758 963201 525
430220 551850 470
5519 517394 470
506437 244645 449
554643 673423 509
836898 678390 504
190601 806528 509
11208 45613 324
487397 575520 470
555645 307706 470
470713 473758 338
53311 654584 509
480146 875459 525
833823 792556 468
366328 232415 441
846311 133955 525
801621 218255 509
560785 346161 470
476319 600432 470
429699 735901 509
50465 366111 443
401156 821184 509
950595 446025 525
208911 257396 443
168462 900124 525
191258 343428 443
612080 602603 403
374157 702136 509
700109 988544 525
502162 94767 449
458380 845326 525
526373 289105 470
462410 798039 509
261727 658121 509
735581 158951 509
198764 549557 470
894527 829847 525
621618 867891 525
92302 423445 449
465211 815857 509
207019 298087 443
260167 745416 509
72831 304448 443
834048 564548 509
168111 142518 383
985077 149929 525
463940 546494 470
255003 451923 449
648062 183300 509
286912 493304 449
913943 2165 525
859521 190616 525
339888 345626 353
401617 935207 525
67928 411294 449
705437 732950 411
280401 865154 525
539625 60805 470
65210 165421 383
610053 378159 470
485632 178090 449
921192 341300 525
415611 974907 525
944717 721012 525
725356 523058 509
260316 537604 470
126657 925915 525
277175 853574 525
559378 495050 470
281836 251770 407
143574 675234 509
490538 74291 449
240594 94948 443
740271 526644 509
392368 591872 470
457980 534955 470
142589 955271 525
947788 670152 525
10812 912193 525
783214 957835 525
582544 55433 470
881161 497470 525
162870 30672 383
957678 476067 525
380002 556164 470
614121 630129 509
466635 589346 470
99104 808102 509
887427 132965 525
39202 72224 340
227504 349744 443
639142 265043 509
735671 375963 509
481100 881844 525
252918 224399 443
128862 982488 525
918860 364114 525
879860 815431 525
865371 940994 507
606606 66389 470
781618 4323 509
743352 251278 509
124250 844600 525
108875 391650 443
925632 169835 525
291792 23455 443
669750 82478 509
236813 472890 449
4187 609455 470
691387 844145 525
131310 193021 383
732177 754559 424
760632 793909 468
534910 577739 452
752507 344229 509
677713 582377 509
728839 307030 509
119002 876839 525
988905 639778 525
617433 913454 525
655817 240088 509
732381 386016 509
785685 440572 509
760090 172940 509
290189 954863 525
886743 403340 525
792398 400987 509
998617 941049 458
480961 403980 449
669349 837598 504
855927 300484 525
537920 362562 470
666199 833399 504
532894 394018 470
618902 61833 470
803219 603667 509
136418 306345 443
844009 586212 525
303902 869343 525
461763 878971 525
746767 904787 525
226755 121879 386
779650 527737 509
175210 275285 443
773678 739635 468
648819 120782 509
313426 278123 389
966825 104408 525
293703 250390 407
179811 228010 386
449162 570398 470
690116 518407 509
925558 286167 525
638859 509629 509
75679 895992 525
625780 970868 525
877305 563073 525
541404 966000 525
337473 660792 509
349766 98158 443
529584 63412 470
840261 977364 507
871435 544178 525
191245 484877 449
744142 234702 509
696048 487024 509
505507 184736 449
221109 421541 449
744253 475706 509
161502 91913 383
622958 414100 470
763158 268167 509
742610 800312 468
758417 577894 509
734509 494478 509
489306 291577 449
982943 611431 525
238636 915027 525
213490 973846 525
379222 269822 441
549507 438569 470
521052 892625 525
709100 531240 509
41874 632004 509
