353919 439173
121101 721144
994523 910485
355137 676433
269545 948229
794391 18069
199251 843599
520328 46804
678366 893393
697471 498810
139231 599437
431049 517210
31283 536230
281526 918582
656827 382220
931805 710801
677938 815333
180393 768300
428905 561823
78843 111594
897148 485490
840866 352570
137664 933277
359435 346588
642419 708612
183392 893361
694709 861964
100983 557827
666010 823439
939417 950097
583688 651890
631276 533742
283322 175429
866328 169843
224864 803326
349612 63833
697920 233463
507911 389347
562751 870521
931897 931649
896602 473393
811600 580348
689998 200113
416331 913098
435577 267283
968456 858228
684228 233015
181539 291237
719722 190888
124945 172079
703319 338179
48965 257074
147221 890714
497786 578809
664021 702263
276112 453692
927245 96979
73377 187160
802376 19783
906725 966776
362525 418558
96700 32780
36339 549716
530572 206629
152899 422695
895864 892003
75504 91432
343734 843725
777177 136427
403074 618682
998563 261722
450996 8552
148652 156983
575740 438419
596655 458814
915295 777655
560189 870142
720367 815786
283885 212892
483081 32303
442266 842147
842871 224069
80332 254919
515385 901216
752083 618106
14504 93443
772944 215483
623703 791579
291473 996256
161681 954585
668072 539231
749262 556760
229150 408325
701577 87169
76165 869313
941435 169844
984630 814273
525693 347386
106583 731673
323171 847703
849564 327811
813432 903309
795676 109227
169215 639711
963632 178617
718403 213403
856864 45532
181490 656656
65413 520528
796322 711551
124442 789846
656936 125524
859517 328486
231499 524009
656417 676454
667523 905472
767 103067
534780 801457
127460 822546
843980 378302
433516 194276
815335 399030
61773 211248
7143 33367
946485 349734
568339 72796
52419 892252
146387 179171
14549 463826
741799 588015
463941 284814
599089 484146
950263 169033
261767 62349
633841 63044
464217 632493
951463 587186
619181 518524
670111 278933
837944 77736
595346 262315
655262 247730
535315 946968
800346 424848
537592 513241
424223 405795
886051 224436
846201 879573
764164 585666
281838 551562
483879 134476
742497 419251
415114 856648
854665 21139
21409 641134
818530 750711
543136 456392
822144 40441
692285 379364
279858 446657
20322 174747
749825 288525
787949 527694
667658 823628
859888 153334
404845 232802
42010 516678
649850 865334
428882 397126
419361 769396
343501 838238
971711 814008
200397 985346
552310 509532
446209 718160
945799 863846
773790 6470
499811 610382
225978 873674
426694 898970
333982 775535
68541 954525
214351 220410
387895 186105
679233 433349
704289 749310
116595 910893
27391 866584
645494 144775
660128 651248
766090 312617
417315 261300
808110 884158
121455 449442
796060 236650
143065 567738
137612 646804
290374 845798
295749 95295
497629 326472
270681 688990
105425 252609
820545 630605
592078 88207
163854 981593
500085 240304
917135 420686
659053 752535
903619 894270
449072 93170
261962 695083
887066 530019
285016 81555
768491 649082
35568 811384
517475 660478
745847 712059
498275 159726
237388 764288
915528 333147
910692 371396
398012 733897
966954 368098
205792 725942
856354 318761
927390 642998
58849 175898
966879 425272
541663 811978
667414 461927
748392 808957
864593 878482
114034 469706
345953 787729
104734 689162
735565 418990
944930 137408
414261 926898
