altgraph==0.17.3
certifi==2022.12.7
chardet==5.1.0
charset-normalizer==3.0.1
customtkinter==5.1.2
darkdetect==0.8.0
defusedxml==0.7.1
docopt==0.6.2
et-xmlfile==1.1.0
idna==3.4
lml==0.1.0
lxml==4.9.2
numpy==1.24.2
openpyxl==3.1.1
packaging==21.3
pandas==1.5.3
pefile==2023.2.7
pika==1.3.1
Pillow==9.4.0
pyexcel==0.7.0
pyexcel-io==0.6.6
pyinstaller==5.8.0
pyinstaller-hooks-contrib==2023.0
pyparsing==3.0.9
python-dateutil==2.8.2
python-dotenv==1.0.0
python-env==1.0.0
pytz==2022.7.1
pywin32-ctypes==0.2.0
requests==2.28.2
six==1.16.0
tableauserverclient==0.24
texttable==1.6.7
urllib3==1.26.14
