{
    "$schema": "http://json.schemastore.org/tslint",
    "line_endings": "unix",
    "defaultSeverity": "error",
    "extends": [
        "tslint:recommended"
    ],
    "jsRules": {},
    "rules": {
        "max-classes-per-file": [true, 2],
        "member-access": [true, "no-public"],
        "object-literal-sort-keys": false,
        "ordered-imports": false,
        "quotemark": [true, "single", "jsx-double"],
        "object-literal-shorthand": false,
        "no-inferrable-types": true,
        "no-var-requires": false,
        "no-unused-variable": true,
        "only-arrow-functions": false
    },
    "rulesDirectory": []
}
