{
  $schema: "https://docs.renovatebot.com/renovate-schema.json",
  extends: [
    "config:base",
    "docker:enableMajor",
    ":automergeBranch",
    ":disableRateLimiting",
    ":dependencyDashboard",
    ":semanticCommits",
    ":skipStatusChecks",
    ":timezone(America/Santiago)",
    ":automergeDigest",
    "gitlab>mapanare-labs/mapanarenet/home-ops//.gitlab/renovate/autoMerge.json5",
    "gitlab>mapanare-labs/mapanarenet/home-ops//.gitlab/renovate/clusters.json5",
    "gitlab>mapanare-labs/mapanarenet/home-ops//.gitlab/renovate/commitMessage.json5",
    "gitlab>mapanare-labs/mapanarenet/home-ops//.gitlab/renovate/grafanaDashboards.json5",
    "gitlab>mapanare-labs/mapanarenet/home-ops//.gitlab/renovate/customManagers.json5",
    "gitlab>mapanare-labs/mapanarenet/home-ops//.gitlab/renovate/groups.json5",
    "gitlab>mapanare-labs/mapanarenet/home-ops//.gitlab/renovate/packageRules.json5",
    "gitlab>mapanare-labs/mapanarenet/home-ops//.gitlab/renovate/labels.json5",
    "gitlab>mapanare-labs/mapanarenet/home-ops//.gitlab/renovate/semanticCommits.json5",
  ],
  //"platform": "gitlab",
  //"onboarding": false,
  //"requireConfig": "optional",
  dependencyDashboardTitle: "Renovate Dashboard 🤖",
  suppressNotifications: ["prEditedNotification", "prIgnoreNotification"],
  rebaseWhen: "conflicted",
  assigneesFromCodeOwners: true,
  reviewersFromCodeOwners: true,
  ignorePaths: ["**/*.sops.*", "**/.archive/**", "**/resources/**"],
  hostRules: [
    {
      matchHost: "docker.io",
      username: "{{ env.CI_DOCKERHUB_USER }}",
      password: "{{ env.CI_DOCKERHUB_PASS }}",
    },
    {
      matchHost: "api.github.com",
      token: "{{ env.GITHUB_COM_TOKEN }}",
    },
    {
      matchHost: "galaxy.ansible.com",
      token: "${CI_ANSIBLE_GALAXY_TOKEN}",
    },
  ],
  flux: {
    fileMatch: ["(^|/)kubernetes/.+\\.ya?ml$"],
  },
  "helm-values": {
    fileMatch: ["(^|/)kubernetes/.+\\.ya?ml$"],
  },
  kubernetes: {
    fileMatch: ["(^|/)\\.taskfiles/.+\\.ya?ml$", "(^|/)kubernetes/.+\\.ya?ml$"],
  },
}
