[gd_scene load_steps=3 format=2]

[ext_resource path="res://Tileset/Environment/Assets Cut/tile125.png" type="Texture" id=1]

[sub_resource type="RectangleShape2D" id=1]

[node name="Gate" type="StaticBody2D"]

[node name="Sprite" type="Sprite" parent="."]
texture = ExtResource( 1 )

[node name="Camera2D" type="Camera2D" parent="."]

[node name="CollisionShape2D" type="CollisionShape2D" parent="."]
shape = SubResource( 1 )
