module github.com/ManuelTello/my-code

go 1.22.3

require (
	filippo.io/edwards25519 v1.1.0 // indirect
	github.com/go-sql-driver/mysql v1.8.1 // indirect
	github.com/golang-jwt/jwt/v5 v5.2.1 // indirect
	github.com/mattn/go-sqlite3 v1.14.22
)
