<?xml version="1.0" encoding="UTF-8" standalone="no"?>
<svg xmlns:dc="http://purl.org/dc/elements/1.1/" xmlns:cc="http://creativecommons.org/ns#" xmlns:rdf="http://www.w3.org/1999/02/22-rdf-syntax-ns#"
        xmlns="http://www.w3.org/2000/svg" xmlns:sodipodi="http://sodipodi.sourceforge.net/DTD/sodipodi-0.dtd"
        xmlns:inkscape="http://www.inkscape.org/namespaces/inkscape" sodipodi:docname="armchair_cell+type.svg"
        inkscape:version="1.0.1 (3bc2e813f5, 2020-09-07)" id="svg8" version="1.1" viewBox="0 0 100 100"
        height="100mm" width="100mm">
  <defs
     id="defs2" />
  <sodipodi:namedview
     inkscape:window-maximized="1"
     inkscape:window-y="0"
     inkscape:window-x="-8"
     inkscape:window-height="2083"
     inkscape:window-width="3051"
     showgrid="false"
     inkscape:document-rotation="0"
     inkscape:current-layer="layer1"
     inkscape:document-units="mm"
     inkscape:cy="386.61215"
     inkscape:cx="160.64275"
     inkscape:zoom="2"
     inkscape:pageshadow="2"
     inkscape:pageopacity="0.0"
     borderopacity="1.0"
     bordercolor="#666666"
     pagecolor="#ffffff"
     id="base"
     inkscape:snap-midpoints="true" />
  <metadata
     id="metadata5">
    <rdf:RDF>
      <cc:Work
         rdf:about="">
        <dc:format>image/svg+xml</dc:format>
        <dc:type
           rdf:resource="http://purl.org/dc/dcmitype/StillImage" />
        <dc:title></dc:title>
      </cc:Work>
    </rdf:RDF>
  </metadata>
  <g
     id="layer1"
     inkscape:groupmode="layer"
     inkscape:label="Layer 1">
    <rect
       style="fill:none;stroke:#000000;stroke-width:2.05807;stroke-dashoffset:0.344658;paint-order:fill markers stroke"
       id="rect839"
       width="77.941925"
       height="41.510548"
       x="11.029035"
       y="8.0290346" />
    <path
       style="fill:none;stroke:#000000;stroke-width:2.05807;stroke-linecap:butt;stroke-linejoin:miter;stroke-miterlimit:4;stroke-dasharray:none;stroke-opacity:1"
       d="M 69.485477,49.53958 V 28.784306 H 30.514516 V 8.029035"
       id="path865" />
    <rect
       style="fill:none;stroke:#000000;stroke-width:2.05807;stroke-dashoffset:0.344658;paint-order:fill markers stroke"
       id="rect839-4"
       width="77.941925"
       height="41.510551"
       x="11.02904"
       y="49.539581" />
    <path
       style="fill:none;stroke:#000000;stroke-width:2.05807;stroke-linecap:butt;stroke-linejoin:miter;stroke-miterlimit:4;stroke-dasharray:none;stroke-opacity:1"
       d="M 69.485482,91.050128 V 70.294854 H 30.514522 V 49.539582"
       id="path865-3" />
  </g>
</svg>
