<?xml version="1.0" encoding="UTF-8" standalone="no"?>
<svg xmlns:dc="http://purl.org/dc/elements/1.1/" xmlns:cc="http://creativecommons.org/ns#" xmlns:rdf="http://www.w3.org/1999/02/22-rdf-syntax-ns#"
        xmlns="http://www.w3.org/2000/svg" xmlns:sodipodi="http://sodipodi.sourceforge.net/DTD/sodipodi-0.dtd"
        xmlns:inkscape="http://www.inkscape.org/namespaces/inkscape" sodipodi:docname="sphinx_cell_type.svg"
        inkscape:version="1.0.1 (3bc2e813f5, 2020-09-07)" id="svg8" version="1.1" viewBox="0 0 100 100"
        height="100mm" width="100mm">
  <defs
     id="defs2" />
  <sodipodi:namedview
     inkscape:window-maximized="1"
     inkscape:window-y="-9"
     inkscape:window-x="-9"
     inkscape:window-height="2093"
     inkscape:window-width="3840"
     showgrid="false"
     inkscape:document-rotation="0"
     inkscape:current-layer="layer1"
     inkscape:document-units="mm"
     inkscape:cy="209.18004"
     inkscape:cx="151.98013"
     inkscape:zoom="1"
     inkscape:pageshadow="2"
     inkscape:pageopacity="0.0"
     borderopacity="1.0"
     bordercolor="#666666"
     pagecolor="#ffffff"
     id="base"
     inkscape:snap-midpoints="true" />
  <metadata
     id="metadata5">
    <rdf:RDF>
      <cc:Work
         rdf:about="">
        <dc:format>image/svg+xml</dc:format>
        <dc:type
           rdf:resource="http://purl.org/dc/dcmitype/StillImage" />
        <dc:title />
      </cc:Work>
    </rdf:RDF>
  </metadata>
  <g
     id="layer1"
     inkscape:groupmode="layer"
     inkscape:label="Layer 1">
    <rect
       transform="matrix(1,0,0.54565839,0.83800771,0,0)"
       y="62.672009"
       x="-10.896384"
       height="37.679508"
       width="53.624737"
       id="rect857-3"
       style="fill:none;stroke:#000000;stroke-width:2.18477133;stroke-miterlimit:4;stroke-dasharray:none"
       inkscape:transform-center-x="36.240897"
       inkscape:transform-center-y="-53.805025" />
    <path
       style="fill:none;stroke:#000000;stroke-width:2;stroke-linecap:butt;stroke-linejoin:miter;stroke-opacity:1;stroke-miterlimit:4;stroke-dasharray:none"
       d="M 73.799742,68.307485 H 46.987375"
       id="path967" />
    <path
       style="fill:none;stroke:#000000;stroke-width:2;stroke-linecap:butt;stroke-linejoin:miter;stroke-miterlimit:4;stroke-dasharray:none;stroke-opacity:1"
       d="m 43.861264,84.095348 3.126111,-15.787863 h 26.812367 l 3.126114,-15.78786"
       id="path969" />
    <rect
       inkscape:transform-center-y="-53.805025"
       inkscape:transform-center-x="36.240897"
       style="fill:none;stroke:#000000;stroke-width:2.18477133;stroke-miterlimit:4;stroke-dasharray:none"
       id="rect857-3-5"
       width="53.624737"
       height="37.679508"
       x="-10.896383"
       y="24.992498"
       transform="matrix(1,0,0.54565838,0.83800771,0,0)" />
    <path
       id="path967-4"
       d="M 53.239609,36.731767 H 26.427238"
       style="fill:none;stroke:#000000;stroke-width:2;stroke-linecap:butt;stroke-linejoin:miter;stroke-opacity:1;stroke-miterlimit:4;stroke-dasharray:none" />
    <path
       id="path969-2"
       d="M 23.301127,52.519629 26.427238,36.731767 H 53.239609 L 56.36572,20.943908"
       style="fill:none;stroke:#000000;stroke-width:2;stroke-linecap:butt;stroke-linejoin:miter;stroke-miterlimit:4;stroke-dasharray:none;stroke-opacity:1" />
  </g>
</svg>
