<?xml version="1.0" encoding="UTF-8" standalone="no"?>
<svg xmlns:dc="http://purl.org/dc/elements/1.1/" xmlns:cc="http://creativecommons.org/ns#" xmlns:rdf="http://www.w3.org/1999/02/22-rdf-syntax-ns#"
        xmlns="http://www.w3.org/2000/svg" xmlns:sodipodi="http://sodipodi.sourceforge.net/DTD/sodipodi-0.dtd"
        xmlns:inkscape="http://www.inkscape.org/namespaces/inkscape" sodipodi:docname="hexagon_cell_type.svg"
        inkscape:version="1.0.2-2 (e86c870879, 2021-01-15)" id="svg8" version="1.1" viewBox="0 0 100 100"
        height="100mm" width="100mm">
  <defs
     id="defs2" />
  <sodipodi:namedview
     inkscape:window-maximized="1"
     inkscape:window-y="-11"
     inkscape:window-x="-11"
     inkscape:window-height="2080"
     inkscape:window-width="3840"
     showgrid="false"
     inkscape:document-rotation="0"
     inkscape:current-layer="layer1"
     inkscape:document-units="mm"
     inkscape:cy="315.76628"
     inkscape:cx="156.42053"
     inkscape:zoom="2.8284271"
     inkscape:pageshadow="2"
     inkscape:pageopacity="0.0"
     borderopacity="1.0"
     bordercolor="#666666"
     pagecolor="#ffffff"
     id="base" />
  <metadata
     id="metadata5">
    <rdf:RDF>
      <cc:Work
         rdf:about="">
        <dc:format>image/svg+xml</dc:format>
        <dc:type
           rdf:resource="http://purl.org/dc/dcmitype/StillImage" />
        <dc:title />
      </cc:Work>
    </rdf:RDF>
  </metadata>
  <g
     id="layer1"
     inkscape:groupmode="layer"
     inkscape:label="Layer 1">
    <path
       sodipodi:type="star"
       style="fill:none;stroke:#000000;stroke-width:2.54736;stroke-miterlimit:4;stroke-dasharray:none;stroke-opacity:1"
       id="path858"
       sodipodi:sides="6"
       sodipodi:cx="50.799999"
       sodipodi:cy="51.990623"
       sodipodi:r1="31.767633"
       sodipodi:r2="27.511578"
       sodipodi:arg1="2.0940746"
       sodipodi:arg2="2.6176734"
       inkscape:flatsided="true"
       inkscape:rounded="0"
       inkscape:randomized="0"
       d="M 34.925001,79.50729 19.032367,52.000805 34.907366,24.484138 66.674998,24.473957 82.567631,51.980442 66.692633,79.497109 Z"
       transform="matrix(0.80780944,0,0,0.76307856,27.701012,30.593461)" />
    <path
       sodipodi:type="star"
       style="fill:none;stroke:#000000;stroke-width:2.54736;stroke-miterlimit:4;stroke-dasharray:none;stroke-opacity:1"
       id="path858-0"
       sodipodi:sides="6"
       sodipodi:cx="50.799999"
       sodipodi:cy="51.990623"
       sodipodi:r1="31.767633"
       sodipodi:r2="27.511578"
       sodipodi:arg1="2.0940746"
       sodipodi:arg2="2.6176734"
       inkscape:flatsided="true"
       inkscape:rounded="0"
       inkscape:randomized="0"
       d="M 34.925001,79.50729 19.032367,52.000805 34.907366,24.484138 66.674998,24.473957 82.567631,51.980442 66.692633,79.497109 Z"
       transform="matrix(0.80780945,0,0,0.76307857,-10.799394,9.6116206)" />
    <path
       sodipodi:type="star"
       style="fill:none;stroke:#000000;stroke-width:2.54736;stroke-miterlimit:4;stroke-dasharray:none;stroke-opacity:1"
       id="path858-9"
       sodipodi:sides="6"
       sodipodi:cx="50.799999"
       sodipodi:cy="51.990623"
       sodipodi:r1="31.767633"
       sodipodi:r2="27.511578"
       sodipodi:arg1="2.0940746"
       sodipodi:arg2="2.6176734"
       inkscape:flatsided="true"
       inkscape:rounded="0"
       inkscape:randomized="0"
       d="M 34.925001,79.50729 19.032367,52.000805 34.907366,24.484138 66.674998,24.473957 82.567631,51.980442 66.692633,79.497109 Z"
       transform="matrix(0.80780945,0,0,0.76307857,27.686765,-11.393526)" />
  </g>
</svg>
