<?xml version="1.0" encoding="UTF-8" standalone="no"?>
<svg
   xmlns:dc="http://purl.org/dc/elements/1.1/"
   xmlns:cc="http://creativecommons.org/ns#"
   xmlns:rdf="http://www.w3.org/1999/02/22-rdf-syntax-ns#"
   xmlns:svg="http://www.w3.org/2000/svg"
   xmlns="http://www.w3.org/2000/svg"
   xmlns:sodipodi="http://sodipodi.sourceforge.net/DTD/sodipodi-0.dtd"
   xmlns:inkscape="http://www.inkscape.org/namespaces/inkscape"
   sodipodi:docname="Points.svg"
   inkscape:version="0.92.5 (2060ec1f9f, 2020-04-08)"
   id="svg8"
   version="1.1"
   viewBox="0 0 100 100"
   height="100mm"
   width="100mm">
  <defs
     id="defs2" />
  <sodipodi:namedview
     inkscape:snap-midpoints="true"
     inkscape:window-maximized="1"
     inkscape:window-y="54"
     inkscape:window-x="0"
     inkscape:window-height="2664"
     inkscape:window-width="5120"
     showgrid="false"
     inkscape:document-rotation="0"
     inkscape:current-layer="layer1"
     inkscape:document-units="mm"
     inkscape:cy="199.85466"
     inkscape:cx="36.129028"
     inkscape:zoom="4"
     inkscape:pageshadow="2"
     inkscape:pageopacity="0.0"
     borderopacity="1.0"
     bordercolor="#666666"
     pagecolor="#ffffff"
     id="base" />
  <metadata
     id="metadata5">
    <rdf:RDF>
      <cc:Work
         rdf:about="">
        <dc:format>image/svg+xml</dc:format>
        <dc:type
           rdf:resource="http://purl.org/dc/dcmitype/StillImage" />
        <dc:title />
      </cc:Work>
    </rdf:RDF>
  </metadata>
  <g
     id="layer1"
     inkscape:groupmode="layer"
     inkscape:label="Layer 1">
    <path
       transform="matrix(-1.5435895,-0.01969388,0.01909089,-1.5640116,130.41998,129.25249)"
       d="M 67.204169,74.083332 39.209053,74.418129 24.921552,50.341045 38.629167,25.929165 66.624283,25.594368 80.911784,49.671451 Z"
       inkscape:randomized="0"
       inkscape:rounded="0"
       inkscape:flatsided="true"
       sodipodi:arg2="1.5588378"
       sodipodi:arg1="1.035239"
       sodipodi:r2="24.246214"
       sodipodi:r1="27.997118"
       sodipodi:cy="50.006248"
       sodipodi:cx="52.916668"
       sodipodi:sides="6"
       id="path927"
       style="fill:none;stroke:#000000;stroke-width:1.6732223;stroke-miterlimit:4;stroke-dasharray:none;stroke-opacity:1"
       sodipodi:type="star" />
    <path
       id="path948"
       d="m 49.693039,49.999998 -0.0153,37.92436"
       style="fill:none;stroke:#000000;stroke-width:2.5999999;stroke-linecap:butt;stroke-linejoin:miter;stroke-miterlimit:4;stroke-dasharray:none;stroke-opacity:1"
       inkscape:connector-curvature="0" />
    <path
       id="path950"
       d="M 17.286166,31.017039 49.693039,49.999996 82.115202,31.058595"
       style="fill:none;stroke:#000000;stroke-width:2.5999999;stroke-linecap:butt;stroke-linejoin:miter;stroke-miterlimit:4;stroke-dasharray:none;stroke-opacity:1"
       inkscape:connector-curvature="0" />
    <text
       xml:space="preserve"
       style="font-style:normal;font-weight:normal;font-size:6.3499999px;line-height:1.25;font-family:sans-serif;letter-spacing:0px;word-spacing:0px;fill:#000000;fill-opacity:1;stroke:none;stroke-width:0.26458332"
       x="1.7305702"
       y="43.358906"
       id="text817"><tspan
         sodipodi:role="line"
         id="tspan815"
         x="1.7305702"
         y="43.358906"
         style="stroke-width:0.26458332">p0</tspan></text>
    <text
       xml:space="preserve"
       style="font-style:normal;font-weight:normal;font-size:6.3499999px;line-height:1.25;font-family:sans-serif;letter-spacing:0px;word-spacing:0px;fill:#000000;fill-opacity:1;stroke:none;stroke-width:0.26458332"
       x="23.47963"
       y="6.1750312"
       id="text821"><tspan
         sodipodi:role="line"
         id="tspan819"
         x="23.47963"
         y="6.1750312"
         style="stroke-width:0.26458332">p1</tspan></text>
    <text
       xml:space="preserve"
       style="font-style:normal;font-weight:normal;font-size:6.3499999px;line-height:1.25;font-family:sans-serif;letter-spacing:0px;word-spacing:0px;fill:#000000;fill-opacity:1;stroke:none;stroke-width:0.26458332"
       x="72.964577"
       y="7.1104746"
       id="text825"><tspan
         sodipodi:role="line"
         id="tspan823"
         x="72.964577"
         y="7.1104746"
         style="stroke-width:0.26458332">p2</tspan></text>
    <text
       xml:space="preserve"
       style="font-style:normal;font-weight:normal;font-size:6.3499999px;line-height:1.25;font-family:sans-serif;letter-spacing:0px;word-spacing:0px;fill:#000000;fill-opacity:1;stroke:none;stroke-width:0.26458332"
       x="92.281487"
       y="61.693592"
       id="text829"><tspan
         sodipodi:role="line"
         id="tspan827"
         x="92.281487"
         y="61.693592"
         style="stroke-width:0.26458332">p3</tspan></text>
    <text
       xml:space="preserve"
       style="font-style:normal;font-weight:normal;font-size:6.3499999px;line-height:1.25;font-family:sans-serif;letter-spacing:0px;word-spacing:0px;fill:#000000;fill-opacity:1;stroke:none;stroke-width:0.26458332"
       x="77.641792"
       y="92.376137"
       id="text833"><tspan
         sodipodi:role="line"
         id="tspan831"
         x="77.641792"
         y="92.376137"
         style="stroke-width:0.26458332">p4</tspan></text>
    <text
       xml:space="preserve"
       style="font-style:normal;font-weight:normal;font-size:6.3499999px;line-height:1.25;font-family:sans-serif;letter-spacing:0px;word-spacing:0px;fill:#000000;fill-opacity:1;stroke:none;stroke-width:0.26458332"
       x="16.884752"
       y="88.868225"
       id="text837"><tspan
         sodipodi:role="line"
         id="tspan835"
         x="16.884752"
         y="88.868225"
         style="stroke-width:0.26458332">p5</tspan></text>
    <text
       xml:space="preserve"
       style="font-style:normal;font-weight:normal;font-size:6.3499999px;line-height:1.25;font-family:sans-serif;letter-spacing:0px;word-spacing:0px;fill:#000000;fill-opacity:1;stroke:none;stroke-width:0.26458332"
       x="45.977039"
       y="39.75745"
       id="text841"><tspan
         sodipodi:role="line"
         id="tspan839"
         x="45.977039"
         y="39.75745"
         style="stroke-width:0.26458332">p6</tspan></text>
    <text
       xml:space="preserve"
       style="font-style:normal;font-weight:normal;font-size:6.3499999px;line-height:1.25;font-family:sans-serif;letter-spacing:0px;word-spacing:0px;fill:#000000;fill-opacity:1;stroke:none;stroke-width:0.26458332"
       x="7.1093693"
       y="26.099974"
       id="text845"><tspan
         sodipodi:role="line"
         id="tspan843"
         x="7.1093693"
         y="26.099974"
         style="stroke-width:0.26458332">p7</tspan></text>
    <text
       xml:space="preserve"
       style="font-style:normal;font-weight:normal;font-size:6.3499999px;line-height:1.25;font-family:sans-serif;letter-spacing:0px;word-spacing:0px;fill:#000000;fill-opacity:1;stroke:none;stroke-width:0.26458332"
       x="85.780159"
       y="28.765989"
       id="text849"><tspan
         sodipodi:role="line"
         id="tspan847"
         x="85.780159"
         y="28.765989"
         style="stroke-width:0.26458332">p8</tspan></text>
    <text
       xml:space="preserve"
       style="font-style:normal;font-weight:normal;font-size:6.3499999px;line-height:1.25;font-family:sans-serif;letter-spacing:0px;word-spacing:0px;fill:#000000;fill-opacity:1;stroke:none;stroke-width:0.26458332"
       x="47.754383"
       y="96.398537"
       id="text853"><tspan
         sodipodi:role="line"
         id="tspan851"
         x="47.754383"
         y="96.398537"
         style="stroke-width:0.26458332">p9</tspan></text>
  </g>
</svg>
