"indice","fecha_tweet","id_usuario_tweet","usuario_tweet","id_tweet","fecha_retweet","id_usuario_retweet","usuario_retweet","fecha_creacion_cuenta","localizacion","followers","friends"
"1","2022-02-09 15:07:47+00:00","1216021318140821507","DualEffectGames","1491428622783361028","2022-02-21 05:28:52+00:00","851984984021753856","AbeDeDino","2017-04-12 02:27:04+00:00","Enslaved by Tom Nook somewhere","92","316"
"2","2022-02-09 15:07:47+00:00","1216021318140821507","DualEffectGames","1491428622783361028","2022-02-20 10:04:36+00:00","371399608","KainlessG","2011-09-10 19:42:15+00:00","Greenwood Lake","291","1700"
"3","2022-02-09 15:07:47+00:00","1216021318140821507","DualEffectGames","1491428622783361028","2022-02-12 16:27:59+00:00","1368461132621635584","shawn39777654","2021-03-07 07:19:20+00:00","","55","211"
"4","2022-02-09 15:07:47+00:00","1216021318140821507","DualEffectGames","1491428622783361028","2022-02-10 21:07:14+00:00","1194609371726135296","beladimitrxscu","2019-11-13 13:34:12+00:00","he/they || 22 || multi || dyl♡","502","771"
"5","2022-02-09 15:07:47+00:00","1216021318140821507","DualEffectGames","1491428622783361028","2022-02-10 14:23:58+00:00","256832878","LightNuss","2011-02-24 04:45:22+00:00","","41","98"
"6","2022-02-09 15:07:47+00:00","1216021318140821507","DualEffectGames","1491428622783361028","2022-02-10 13:16:27+00:00","521883371","Tim3_Rainbow","2012-03-12 02:31:04+00:00","Raccoon City","159","1197"
"7","2022-02-09 15:07:47+00:00","1216021318140821507","DualEffectGames","1491428622783361028","2022-02-10 13:12:54+00:00","1430595635737243655","JenHildebrand10","2021-08-25 18:19:31+00:00","United States","58","62"
"8","2022-02-09 15:07:47+00:00","1216021318140821507","DualEffectGames","1491428622783361028","2022-02-10 09:43:26+00:00","1716268585","parkkaeyeon","2013-08-31 17:05:07+00:00","","321","619"
"9","2022-02-09 15:07:47+00:00","1216021318140821507","DualEffectGames","1491428622783361028","2022-02-10 09:08:19+00:00","778365725450833922","O_Midnight777","2016-09-20 22:50:25+00:00","Salvador, Brasil","11","74"
"10","2022-02-09 15:07:47+00:00","1216021318140821507","DualEffectGames","1491428622783361028","2022-02-10 03:06:54+00:00","1175959771473727488","BruckerGuido","2019-09-23 02:28:08+00:00","Germany","65","261"
"11","2022-02-09 15:07:47+00:00","1216021318140821507","DualEffectGames","1491428622783361028","2022-02-10 01:15:56+00:00","135837077","GoYiTsU","2010-04-22 10:38:16+00:00","","41","160"
"12","2022-02-09 15:07:47+00:00","1216021318140821507","DualEffectGames","1491428622783361028","2022-02-10 00:34:46+00:00","1376576343530430464","shawnjazz1","2021-03-29 16:46:05+00:00","","167","1388"
"13","2022-02-09 15:07:47+00:00","1216021318140821507","DualEffectGames","1491428622783361028","2022-02-09 21:23:41+00:00","332193435","Backlife94","2011-07-09 11:18:27+00:00","Spain","694","1069"
"14","2022-02-09 15:07:47+00:00","1216021318140821507","DualEffectGames","1491428622783361028","2022-02-09 21:09:54+00:00","59385630","lil__kame","2009-07-23 06:48:54+00:00","Now Cdmx  ex Stgo","2032","837"
"15","2022-02-09 15:07:47+00:00","1216021318140821507","DualEffectGames","1491428622783361028","2022-02-09 21:07:00+00:00","20979568","AlnBeto","2009-02-16 12:00:05+00:00","Japão","455","406"
"16","2022-02-09 15:07:47+00:00","1216021318140821507","DualEffectGames","1491428622783361028","2022-02-09 20:19:48+00:00","1432834447242563592","leonsupremacist","2021-08-31 22:35:38+00:00","he/him","315","345"
"17","2022-02-09 15:07:47+00:00","1216021318140821507","DualEffectGames","1491428622783361028","2022-02-09 20:00:58+00:00","74532373","Lidia_Alvarez_G","2009-09-15 19:32:35+00:00","Las Palmas de Gran Canaria","1284","2287"
"18","2022-02-09 15:07:47+00:00","1216021318140821507","DualEffectGames","1491428622783361028","2022-02-09 19:57:18+00:00","1375206762530414594","Alex68908170","2021-03-25 22:03:56+00:00","Málaga, España","130","589"
"19","2022-02-09 15:07:47+00:00","1216021318140821507","DualEffectGames","1491428622783361028","2022-02-09 19:29:52+00:00","1217730832154017792","kt_7079","2020-01-16 08:50:40+00:00","Seattle, WA","100","1239"
"20","2022-02-09 15:07:47+00:00","1216021318140821507","DualEffectGames","1491428622783361028","2022-02-09 19:06:42+00:00","111439578","KajiMateria","2010-02-04 23:04:24+00:00","Panama, Panama","359","942"
"21","2022-02-09 15:07:47+00:00","1216021318140821507","DualEffectGames","1491428622783361028","2022-02-09 18:44:52+00:00","242575176","Lord_of_the_RPG","2011-01-25 02:57:19+00:00","Banoi ","153","1514"
"22","2022-02-09 15:07:47+00:00","1216021318140821507","DualEffectGames","1491428622783361028","2022-02-09 18:25:33+00:00","1439624155","DJ_crazy9","2013-05-18 22:32:22+00:00","Edmonton AB","268","1470"
"23","2022-02-09 15:07:47+00:00","1216021318140821507","DualEffectGames","1491428622783361028","2022-02-09 18:04:21+00:00","1306710719686152192","villian_black","2020-09-17 21:45:21+00:00","","0","22"
"24","2022-02-09 15:07:47+00:00","1216021318140821507","DualEffectGames","1491428622783361028","2022-02-09 17:52:17+00:00","64874876","Whitebait24","2009-08-12 00:19:10+00:00","London, England","187","3582"
"25","2022-02-09 15:07:47+00:00","1216021318140821507","DualEffectGames","1491428622783361028","2022-02-09 17:16:28+00:00","1041862881069985792","lollyrots","2018-09-18 01:34:02+00:00","","581","357"
"26","2022-02-09 15:07:47+00:00","1216021318140821507","DualEffectGames","1491428622783361028","2022-02-09 17:12:49+00:00","568412466","Helexzura","2012-05-01 16:13:12+00:00","Texas, USA","5744","1254"
"27","2022-02-09 15:07:47+00:00","1216021318140821507","DualEffectGames","1491428622783361028","2022-02-09 16:36:58+00:00","846428044042526720","cherrygiirl__","2017-03-27 18:25:46+00:00","CDMX","1869","164"
"28","2022-02-09 15:07:47+00:00","1216021318140821507","DualEffectGames","1491428622783361028","2022-02-09 16:09:36+00:00","771254386668343296","IgarciaWorkout","2016-09-01 07:52:30+00:00","Ashina","550","573"
"29","2022-02-09 15:07:47+00:00","1216021318140821507","DualEffectGames","1491428622783361028","2022-02-09 16:05:11+00:00","2466555282","moukiez","2014-04-27 19:34:55+00:00","Toronto, Ontario","222","377"
"30","2022-02-09 15:07:47+00:00","1216021318140821507","DualEffectGames","1491428622783361028","2022-02-09 15:50:55+00:00","1069833478198517761","FishPale","2018-12-04 05:59:12+00:00","Inside your percolator","112","103"
"31","2022-02-09 15:07:47+00:00","1216021318140821507","DualEffectGames","1491428622783361028","2022-02-09 15:41:01+00:00","1068523519305113600","AdamVzz","2018-11-30 15:13:54+00:00","Aracaju, Brasil","771","1437"
"32","2022-02-09 15:07:47+00:00","1216021318140821507","DualEffectGames","1491428622783361028","2022-02-09 15:31:45+00:00","20006693","JhonRojas","2009-02-03 21:42:56+00:00","Chimbote, Perú","11558","357"
"33","2022-02-09 15:07:47+00:00","1216021318140821507","DualEffectGames","1491428622783361028","2022-02-09 15:31:33+00:00","1172058660962541568","Yumimogry","2019-09-12 08:05:44+00:00","","300","332"
"34","2022-02-09 15:07:47+00:00","1216021318140821507","DualEffectGames","1491428622783361028","2022-02-09 15:24:13+00:00","714975161729073152","iloveklim","2016-03-30 00:38:56+00:00","Ireland","98","338"
"35","2022-02-09 15:07:47+00:00","1216021318140821507","DualEffectGames","1491428622783361028","2022-02-09 15:24:07+00:00","63942180","hazardman89","2009-08-08 09:46:14+00:00","Your Mom's House","222","154"
"36","2022-02-09 15:07:47+00:00","1216021318140821507","DualEffectGames","1491428622783361028","2022-02-09 15:22:08+00:00","954662426","etofanelo","2012-11-18 01:57:34+00:00","São Paulo, Brasil","336","312"
"37","2022-02-09 15:07:47+00:00","1216021318140821507","DualEffectGames","1491428622783361028","2022-02-09 15:18:16+00:00","70708237","scarletbeyond93","2009-09-01 15:37:57+00:00","North East, England","241","1185"
"38","2022-02-09 15:07:47+00:00","1216021318140821507","DualEffectGames","1491428622783361028","2022-02-09 15:14:07+00:00","369575160","Milie42","2011-09-07 15:56:29+00:00","Aisne ; France","94","152"
"39","2022-02-09 15:07:47+00:00","1216021318140821507","DualEffectGames","1491428622783361028","2022-02-09 15:11:31+00:00","1168776978805207040","RitterVitaly","2019-09-03 06:45:40+00:00","Deutschland","108","224"
"40","2022-02-09 15:07:47+00:00","1216021318140821507","DualEffectGames","1491428622783361028","2022-02-09 15:09:49+00:00","116382183","NiftyKitsune","2010-02-22 07:26:08+00:00","United States","269","914"
"41","2022-02-09 15:07:47+00:00","1216021318140821507","DualEffectGames","1491428622783361028","2022-02-09 15:09:05+00:00","125271473","RENOtsego","2010-03-22 08:07:17+00:00","~NoWhere~","57","523"
"42","2022-01-11 23:33:11+00:00","1216021318140821507","DualEffectGames","1481046562918776833","2022-01-12 15:07:22+00:00","1433266796014931969","Zkam1988","2021-09-02 03:13:36+00:00","Gold Coast Australia ","55","322"
"43","2022-01-11 23:33:11+00:00","1216021318140821507","DualEffectGames","1481046562918776833","2022-01-12 14:16:38+00:00","256832878","LightNuss","2011-02-24 04:45:22+00:00","","41","98"
"44","2022-01-11 23:33:11+00:00","1216021318140821507","DualEffectGames","1481046562918776833","2022-01-12 11:52:07+00:00","10284642","linken","2007-11-15 19:28:17+00:00","Rancagua","1845","2883"
"45","2022-01-11 23:33:11+00:00","1216021318140821507","DualEffectGames","1481046562918776833","2022-01-12 09:48:36+00:00","861483050","HayatoGGWP","2012-10-04 14:25:07+00:00","Argentina","386","963"
"46","2022-01-11 23:33:11+00:00","1216021318140821507","DualEffectGames","1481046562918776833","2022-01-12 06:21:47+00:00","59385630","lil__kame","2009-07-23 06:48:54+00:00","Now Cdmx  ex Stgo","2032","837"
"47","2022-01-11 23:33:11+00:00","1216021318140821507","DualEffectGames","1481046562918776833","2022-01-12 05:16:05+00:00","2293894986","GoodFrigginGame","2014-01-16 05:28:01+00:00","California","97","391"
"48","2022-01-11 23:33:11+00:00","1216021318140821507","DualEffectGames","1481046562918776833","2022-01-12 04:58:32+00:00","39187827","IAreCaspernator","2009-05-11 04:00:51+00:00","Hartford, CT","194","828"
"49","2022-01-11 23:33:11+00:00","1216021318140821507","DualEffectGames","1481046562918776833","2022-01-12 04:55:39+00:00","1242550855","KawaiiMess","2013-03-05 00:51:49+00:00","","1269","1039"
"50","2022-01-11 23:33:11+00:00","1216021318140821507","DualEffectGames","1481046562918776833","2022-01-12 04:42:44+00:00","118175199","Thennecan","2010-02-27 20:56:42+00:00","Lima, Peru","1025","1005"
"51","2022-01-11 23:33:11+00:00","1216021318140821507","DualEffectGames","1481046562918776833","2022-01-12 03:46:08+00:00","175305859","el_KEVLAR","2010-08-06 06:53:11+00:00","Santiago","348","410"
"52","2022-01-11 23:33:11+00:00","1216021318140821507","DualEffectGames","1481046562918776833","2022-01-12 02:23:22+00:00","41702532","ElYurado","2009-05-21 23:34:35+00:00","Chillán, Chile","4118","5001"
"53","2022-01-11 23:33:11+00:00","1216021318140821507","DualEffectGames","1481046562918776833","2022-01-12 00:19:12+00:00","131202007","zeru64","2010-04-09 15:39:06+00:00","Hyrule","209","432"
"54","2022-01-11 23:33:11+00:00","1216021318140821507","DualEffectGames","1481046562918776833","2022-01-12 00:09:11+00:00","1109551905066418178","ViperSchmidt","2019-03-23 20:26:03+00:00","Chile","149","152"
"55","2022-01-11 23:33:11+00:00","1216021318140821507","DualEffectGames","1481046562918776833","2022-01-11 23:42:48+00:00","1080967778398601221","HeyImMozz","2019-01-03 23:22:56+00:00","✉: Mozzzgames@gmail.com","298","453"
"56","2022-01-11 23:33:11+00:00","1216021318140821507","DualEffectGames","1481046562918776833","2022-01-11 23:37:08+00:00","1536072422","RebeccaRE13","2013-06-21 08:39:35+00:00","Santiago, Chile","5207","1091"
"57","2022-01-11 17:46:07+00:00","1216021318140821507","DualEffectGames","1480959219872456718","2022-01-12 15:07:26+00:00","1433266796014931969","Zkam1988","2021-09-02 03:13:36+00:00","Gold Coast Australia ","55","322"
"58","2022-01-11 17:46:07+00:00","1216021318140821507","DualEffectGames","1480959219872456718","2022-01-12 04:09:19+00:00","41702532","ElYurado","2009-05-21 23:34:35+00:00","Chillán, Chile","4118","5001"
"59","2022-01-11 17:46:07+00:00","1216021318140821507","DualEffectGames","1480959219872456718","2022-01-12 01:03:05+00:00","193931306","AngelGuti3rr3z","2010-09-23 00:47:57+00:00","","53","656"
"60","2022-01-11 17:46:07+00:00","1216021318140821507","DualEffectGames","1480959219872456718","2022-01-11 21:14:45+00:00","22964434","Magnaxeon","2009-03-05 19:30:14+00:00","Santiago","424","1576"
"61","2022-01-11 17:46:07+00:00","1216021318140821507","DualEffectGames","1480959219872456718","2022-01-11 21:03:02+00:00","1721002308","PAWAcl","2013-09-02 03:25:01+00:00","Santiago, CL","2261","495"
"62","2022-01-11 17:46:07+00:00","1216021318140821507","DualEffectGames","1480959219872456718","2022-01-11 20:49:45+00:00","345239724","andypearson86","2011-07-30 08:01:08+00:00","Sheffield, UK","592","241"
"63","2021-12-31 22:08:33+00:00","1216021318140821507","DualEffectGames","1477038998426169349","2022-01-30 05:23:42+00:00","1430595635737243655","JenHildebrand10","2021-08-25 18:19:31+00:00","United States","58","62"
"64","2021-12-31 22:08:33+00:00","1216021318140821507","DualEffectGames","1477038998426169349","2022-01-09 22:26:15+00:00","1268322606408765440","Duque_Orlok","2020-06-03 23:24:20+00:00","Bran, România","8","587"
"65","2021-12-31 22:08:33+00:00","1216021318140821507","DualEffectGames","1477038998426169349","2022-01-06 13:21:36+00:00","1301014419674025984","Morimereaper","2020-09-02 04:29:56+00:00","Australia","102","237"
"66","2021-12-31 22:08:33+00:00","1216021318140821507","DualEffectGames","1477038998426169349","2022-01-05 11:02:54+00:00","417150477","mahddyboy","2011-11-20 15:57:40+00:00","Lagos, Nigeria","1664","5000"
"67","2021-12-31 22:08:33+00:00","1216021318140821507","DualEffectGames","1477038998426169349","2022-01-05 10:59:00+00:00","556384735","LordDagak","2012-04-17 23:40:53+00:00","","42","234"
"68","2021-12-31 22:08:33+00:00","1216021318140821507","DualEffectGames","1477038998426169349","2022-01-05 10:41:33+00:00","1224171621990174720","RedReaperComet","2020-02-03 03:23:59+00:00","","37","536"
"69","2021-12-31 22:08:33+00:00","1216021318140821507","DualEffectGames","1477038998426169349","2022-01-05 10:30:10+00:00","279063565","PQubeGames","2011-04-08 14:25:31+00:00","London, England","35557","144"
"70","2021-12-31 22:08:33+00:00","1216021318140821507","DualEffectGames","1477038998426169349","2022-01-05 10:24:53+00:00","1194927432966561792","PQubeIndies","2019-11-14 10:38:01+00:00","London","10015","209"
"71","2021-12-31 22:08:33+00:00","1216021318140821507","DualEffectGames","1477038998426169349","2022-01-01 12:52:31+00:00","1433266796014931969","Zkam1988","2021-09-02 03:13:36+00:00","Gold Coast Australia ","55","322"
"72","2021-12-31 22:08:33+00:00","1216021318140821507","DualEffectGames","1477038998426169349","2022-01-01 11:41:43+00:00","957292025879154689","AlexanderBruyns","2018-01-27 16:39:39+00:00","Belgium","1604","1609"
"73","2021-12-31 22:08:33+00:00","1216021318140821507","DualEffectGames","1477038998426169349","2022-01-01 01:17:03+00:00","1331844614656036864","caueborgesart","2020-11-26 06:18:05+00:00","São Paulo, Brasil","57","307"
"74","2021-12-31 22:08:33+00:00","1216021318140821507","DualEffectGames","1477038998426169349","2022-01-01 00:33:57+00:00","3600893001","Guxzero","2015-09-09 18:19:49+00:00","","48","262"
"75","2021-12-31 22:08:33+00:00","1216021318140821507","DualEffectGames","1477038998426169349","2022-01-01 00:32:58+00:00","1043180971464503298","JaredBrickey","2018-09-21 16:51:39+00:00","","85","337"
"76","2021-12-31 22:08:33+00:00","1216021318140821507","DualEffectGames","1477038998426169349","2021-12-31 23:10:07+00:00","1095721031354978305","AsabelMm","2019-02-13 16:27:06+00:00","","27","252"
"77","2021-12-31 22:08:33+00:00","1216021318140821507","DualEffectGames","1477038998426169349","2021-12-31 22:44:02+00:00","770951003902533632","Nemesis199x","2016-08-31 11:46:57+00:00","","4","238"
"78","2021-12-31 22:08:33+00:00","1216021318140821507","DualEffectGames","1477038998426169349","2021-12-31 22:43:08+00:00","345239724","andypearson86","2011-07-30 08:01:08+00:00","Sheffield, UK","592","241"
"79","2021-12-31 22:08:33+00:00","1216021318140821507","DualEffectGames","1477038998426169349","2021-12-31 22:36:11+00:00","1092854292","lgupload01","2013-01-15 18:19:23+00:00","","74","27"
"80","2021-12-31 22:08:33+00:00","1216021318140821507","DualEffectGames","1477038998426169349","2021-12-31 22:21:34+00:00","1358308484211564544","johnkyl86832423","2021-02-07 06:56:02+00:00","","1","18"
"81","2021-12-31 22:08:33+00:00","1216021318140821507","DualEffectGames","1477038998426169349","2021-12-31 22:18:27+00:00","97047804","Wakingnitedream","2009-12-15 19:46:42+00:00","Somewhere between the stars","388","480"
"82","2021-12-31 22:08:33+00:00","1216021318140821507","DualEffectGames","1477038998426169349","2021-12-31 22:11:29+00:00","1002936322787602432","faris199819","2018-06-02 15:33:47+00:00","","29","104"
"83","2021-12-31 22:08:33+00:00","1216021318140821507","DualEffectGames","1477038998426169349","2021-12-31 22:09:56+00:00","2398394586","heyInaGame","2014-03-19 20:13:39+00:00","Barcelona","1368","633"
"84","2021-12-31 22:08:33+00:00","1216021318140821507","DualEffectGames","1477038998426169349","2021-12-31 22:08:48+00:00","911350985699807233","k3ioske","2017-09-22 22:06:21+00:00","Raccoon City","27","58"
"85","2021-12-15 00:57:46+00:00","1216021318140821507","DualEffectGames","1470920986845343748","2021-12-17 05:08:58+00:00","289642817","AL_NEMESIS","2011-04-29 00:21:37+00:00","Hunucmá, Yucatán","40","929"
"86","2021-12-15 00:57:46+00:00","1216021318140821507","DualEffectGames","1470920986845343748","2021-12-15 06:57:59+00:00","4471400849","Bass_N_Roll","2015-12-13 15:13:27+00:00","France","379","870"
"87","2021-12-15 00:57:46+00:00","1216021318140821507","DualEffectGames","1470920986845343748","2021-12-15 02:34:07+00:00","911350985699807233","k3ioske","2017-09-22 22:06:21+00:00","Raccoon City","27","58"
"88","2021-12-15 00:57:46+00:00","1216021318140821507","DualEffectGames","1470920986845343748","2021-12-15 01:07:19+00:00","152421280","claudionoera","2010-06-05 23:00:09+00:00","Santiago, Chile","1035","677"
"89","2021-12-15 00:57:46+00:00","1216021318140821507","DualEffectGames","1470920986845343748","2021-12-15 01:05:55+00:00","861483050","HayatoGGWP","2012-10-04 14:25:07+00:00","Argentina","386","963"
"90","2021-12-15 00:57:46+00:00","1216021318140821507","DualEffectGames","1470920986845343748","2021-12-15 01:01:19+00:00","1095721031354978305","AsabelMm","2019-02-13 16:27:06+00:00","","27","252"
"91","2021-12-01 00:01:20+00:00","1216021318140821507","DualEffectGames","1465833355447050248","2022-01-11 03:41:46+00:00","1336335938855714817","QueenElf12","2020-12-08 15:45:07+00:00","","4","67"
"92","2021-12-01 00:01:20+00:00","1216021318140821507","DualEffectGames","1465833355447050248","2021-12-04 13:03:59+00:00","1376576343530430464","shawnjazz1","2021-03-29 16:46:05+00:00","","167","1388"
"93","2021-12-01 00:01:20+00:00","1216021318140821507","DualEffectGames","1465833355447050248","2021-12-01 11:40:11+00:00","1296251933662105601","PlayMusicNow1","2020-08-20 01:05:40+00:00","","6","135"
"94","2021-12-01 00:01:20+00:00","1216021318140821507","DualEffectGames","1465833355447050248","2021-12-01 02:58:42+00:00","1002936322787602432","faris199819","2018-06-02 15:33:47+00:00","","29","104"
"95","2021-12-01 00:01:20+00:00","1216021318140821507","DualEffectGames","1465833355447050248","2021-12-01 01:24:23+00:00","1168776978805207040","RitterVitaly","2019-09-03 06:45:40+00:00","Deutschland","108","224"
"96","2021-11-23 01:49:47+00:00","1216021318140821507","DualEffectGames","1462961546766602244","2022-01-30 05:26:30+00:00","1430595635737243655","JenHildebrand10","2021-08-25 18:19:31+00:00","United States","58","62"
"97","2021-11-23 01:49:47+00:00","1216021318140821507","DualEffectGames","1462961546766602244","2021-12-24 17:33:21+00:00","1433266796014931969","Zkam1988","2021-09-02 03:13:36+00:00","Gold Coast Australia ","55","322"
"98","2021-11-23 01:49:47+00:00","1216021318140821507","DualEffectGames","1462961546766602244","2021-11-28 15:21:06+00:00","1376576343530430464","shawnjazz1","2021-03-29 16:46:05+00:00","","167","1388"
"99","2021-11-23 01:49:47+00:00","1216021318140821507","DualEffectGames","1462961546766602244","2021-11-23 18:50:56+00:00","163303484","wesleyw50","2010-07-06 02:19:49+00:00","","708","4790"
"100","2021-11-23 01:49:47+00:00","1216021318140821507","DualEffectGames","1462961546766602244","2021-11-23 15:10:32+00:00","1316616853389746176","GNoctumbro","2020-10-15 05:48:22+00:00","","42","198"
"101","2021-11-23 01:49:47+00:00","1216021318140821507","DualEffectGames","1462961546766602244","2021-11-23 11:37:51+00:00","1193134863777488896","beardshock","2019-11-09 11:55:16+00:00","","8","160"
"102","2021-11-23 01:49:47+00:00","1216021318140821507","DualEffectGames","1462961546766602244","2021-11-23 06:09:14+00:00","3102412433","masallaorion86","2015-03-21 18:24:40+00:00","Madrid","1138","1414"
"103","2021-11-23 01:49:47+00:00","1216021318140821507","DualEffectGames","1462961546766602244","2021-11-23 04:42:18+00:00","1041728082737082369","GeminiMeillon","2018-09-17 16:38:24+00:00","Mexico","42","1150"
"104","2021-11-23 01:49:47+00:00","1216021318140821507","DualEffectGames","1462961546766602244","2021-11-23 03:51:45+00:00","2882691592","Galixtron","2014-11-18 14:24:38+00:00","Donostia","108","637"
"105","2021-11-23 01:49:47+00:00","1216021318140821507","DualEffectGames","1462961546766602244","2021-11-23 03:04:27+00:00","1275525760309235713","mythicflight","2020-06-23 20:27:12+00:00","Racoon City ","179","395"
"106","2021-11-23 01:49:47+00:00","1216021318140821507","DualEffectGames","1462961546766602244","2021-11-23 02:43:15+00:00","3144942273","Noor_q21","2015-04-07 18:19:32+00:00","الرياض","71","126"
"107","2021-11-23 01:49:47+00:00","1216021318140821507","DualEffectGames","1462961546766602244","2021-11-23 02:00:42+00:00","1507806571","MoisesFeelGames","2013-06-12 00:32:53+00:00","Alvorada - RS","760","1167"
"108","2021-11-23 01:49:47+00:00","1216021318140821507","DualEffectGames","1462961546766602244","2021-11-23 01:54:49+00:00","33085220","AsherV20","2009-04-19 01:38:25+00:00","Philadelphia, PA","111","265"
"109","2021-10-29 20:23:04+00:00","1216021318140821507","DualEffectGames","1454182013850824704","2021-11-17 15:41:33+00:00","1433266796014931969","Zkam1988","2021-09-02 03:13:36+00:00","Gold Coast Australia ","55","322"
"110","2021-10-29 20:23:04+00:00","1216021318140821507","DualEffectGames","1454182013850824704","2021-10-30 18:39:41+00:00","256832878","LightNuss","2011-02-24 04:45:22+00:00","","41","98"
"111","2021-10-29 20:23:04+00:00","1216021318140821507","DualEffectGames","1454182013850824704","2021-10-30 17:40:18+00:00","289642817","AL_NEMESIS","2011-04-29 00:21:37+00:00","Hunucmá, Yucatán","40","929"
"112","2021-10-29 20:23:04+00:00","1216021318140821507","DualEffectGames","1454182013850824704","2021-10-30 12:40:10+00:00","1040268869158531072","Boy05527772","2018-09-13 16:00:00+00:00","Limburg, Nederland","4","65"
"113","2021-10-29 20:23:04+00:00","1216021318140821507","DualEffectGames","1454182013850824704","2021-10-30 10:46:41+00:00","1433266796014931969","Zkam1988","2021-09-02 03:13:36+00:00","Gold Coast Australia ","55","322"
"114","2021-10-29 20:23:04+00:00","1216021318140821507","DualEffectGames","1454182013850824704","2021-10-30 10:09:39+00:00","381067191","ravenrenault","2011-09-27 17:55:12+00:00","Royal Space Society HUB","978","1129"
"115","2021-10-29 20:23:04+00:00","1216021318140821507","DualEffectGames","1454182013850824704","2021-10-30 07:13:47+00:00","124659392","feipie","2010-03-20 04:09:32+00:00","","18","59"
"116","2021-10-29 20:23:04+00:00","1216021318140821507","DualEffectGames","1454182013850824704","2021-10-30 04:46:46+00:00","2171577337","jvargas7777","2013-11-03 05:41:43+00:00","California, USA","207","173"
"117","2021-10-29 20:23:04+00:00","1216021318140821507","DualEffectGames","1454182013850824704","2021-10-30 03:55:29+00:00","1060302031150186496","3olf17","2018-11-07 22:44:38+00:00","","514","2742"
"118","2021-10-29 20:23:04+00:00","1216021318140821507","DualEffectGames","1454182013850824704","2021-10-30 02:13:54+00:00","1376576343530430464","shawnjazz1","2021-03-29 16:46:05+00:00","","167","1388"
"119","2021-10-29 20:23:04+00:00","1216021318140821507","DualEffectGames","1454182013850824704","2021-10-30 00:31:13+00:00","4577211762","Dustman_B","2015-12-16 18:16:49+00:00","","222","298"
"120","2021-10-29 20:23:04+00:00","1216021318140821507","DualEffectGames","1454182013850824704","2021-10-29 23:56:33+00:00","1129062763693838339","GEM4337","2019-05-16 16:35:14+00:00","المملكة العربية السعودية","27","184"
"121","2021-10-29 20:23:04+00:00","1216021318140821507","DualEffectGames","1454182013850824704","2021-10-29 23:21:42+00:00","1092854292","lgupload01","2013-01-15 18:19:23+00:00","","74","27"
"122","2021-10-29 20:23:04+00:00","1216021318140821507","DualEffectGames","1454182013850824704","2021-10-29 22:06:09+00:00","963123008251531265","LatinxGamesFest","2018-02-12 18:49:53+00:00","Long Beach, CA","1727","223"
"123","2021-10-29 20:23:04+00:00","1216021318140821507","DualEffectGames","1454182013850824704","2021-10-29 21:44:12+00:00","1408259850937810947","Lonewolfgamer13","2021-06-25 03:05:03+00:00","","66","750"
"124","2021-10-29 20:23:04+00:00","1216021318140821507","DualEffectGames","1454182013850824704","2021-10-29 21:29:25+00:00","1034775625716908033","MatiasAV4","2018-08-29 12:11:49+00:00","","28","44"
"125","2021-10-29 20:23:04+00:00","1216021318140821507","DualEffectGames","1454182013850824704","2021-10-29 21:01:19+00:00","838951455348379648","PURITALIANBLOOD","2017-03-07 03:16:28+00:00","Raccoon City","1183","663"
"126","2021-10-29 20:23:04+00:00","1216021318140821507","DualEffectGames","1454182013850824704","2021-10-29 20:48:01+00:00","20006693","JhonRojas","2009-02-03 21:42:56+00:00","Chimbote, Perú","11558","357"
"127","2021-10-29 20:23:04+00:00","1216021318140821507","DualEffectGames","1454182013850824704","2021-10-29 20:37:56+00:00","52885852","trpzn","2009-07-01 23:14:31+00:00","Viña del mar Chile","262","570"
"128","2021-10-29 20:23:04+00:00","1216021318140821507","DualEffectGames","1454182013850824704","2021-10-29 20:28:18+00:00","3148805538","Trogistreed420","2015-04-11 01:41:59+00:00","York, PA","362","875"
"129","2021-10-29 20:23:04+00:00","1216021318140821507","DualEffectGames","1454182013850824704","2021-10-29 20:26:00+00:00","957292025879154689","AlexanderBruyns","2018-01-27 16:39:39+00:00","Belgium","1604","1609"
"130","2021-10-29 20:23:04+00:00","1216021318140821507","DualEffectGames","1454182013850824704","2021-10-29 20:25:49+00:00","898448013135237120","EsotericPaladin","2017-08-18 07:34:33+00:00","Las Vegas, NV","173","341"
"131","2021-10-29 06:21:09+00:00","1216021318140821507","DualEffectGames","1453970138374410241","2021-10-29 18:19:13+00:00","1376576343530430464","shawnjazz1","2021-03-29 16:46:05+00:00","","167","1388"
"132","2021-10-29 06:21:09+00:00","1216021318140821507","DualEffectGames","1453970138374410241","2021-10-29 14:09:50+00:00","1092854292","lgupload01","2013-01-15 18:19:23+00:00","","74","27"
"133","2021-10-29 06:21:09+00:00","1216021318140821507","DualEffectGames","1453970138374410241","2021-10-29 08:27:08+00:00","995348315435929600","Othman_Logan9","2018-05-12 17:01:45+00:00","","700","2201"
"134","2021-10-29 06:21:09+00:00","1216021318140821507","DualEffectGames","1453970138374410241","2021-10-29 07:47:47+00:00","1282941276686557184","Follow_14_","2020-07-14 07:33:45+00:00","Москва, Россия","159","490"
"135","2021-10-29 06:21:09+00:00","1216021318140821507","DualEffectGames","1453970138374410241","2021-10-29 07:19:06+00:00","1433266796014931969","Zkam1988","2021-09-02 03:13:36+00:00","Gold Coast Australia ","55","322"
"136","2021-10-29 06:21:09+00:00","1216021318140821507","DualEffectGames","1453970138374410241","2021-10-29 07:16:22+00:00","1536072422","RebeccaRE13","2013-06-21 08:39:35+00:00","Santiago, Chile","5207","1091"
"137","2021-10-29 06:21:09+00:00","1216021318140821507","DualEffectGames","1453970138374410241","2021-10-29 06:53:26+00:00","1168776978805207040","RitterVitaly","2019-09-03 06:45:40+00:00","Deutschland","108","224"
"138","2021-10-29 06:21:09+00:00","1216021318140821507","DualEffectGames","1453970138374410241","2021-10-29 06:40:19+00:00","907171467372236800","sarada_amal","2017-09-11 09:18:27+00:00",". ","132","184"
"139","2021-10-27 17:19:38+00:00","1216021318140821507","DualEffectGames","1453411077522341895","2022-02-02 17:46:15+00:00","1407536840647794694","SmugKaiSupreme","2021-06-23 03:12:05+00:00","","318","787"
"140","2021-10-27 17:19:38+00:00","1216021318140821507","DualEffectGames","1453411077522341895","2021-10-29 07:13:52+00:00","46956704","TehParalyzer","2009-06-13 20:25:44+00:00","Fresno, California","218","505"
"141","2021-10-27 17:19:38+00:00","1216021318140821507","DualEffectGames","1453411077522341895","2021-10-29 01:07:21+00:00","1402095268976377856","LaFanatic1985","2021-06-08 02:49:10+00:00","","41","202"
"142","2021-10-27 17:19:38+00:00","1216021318140821507","DualEffectGames","1453411077522341895","2021-10-28 19:28:35+00:00","740737599027990528","AnironArts","2016-06-09 02:49:40+00:00","","4","39"
"143","2021-10-27 17:19:38+00:00","1216021318140821507","DualEffectGames","1453411077522341895","2021-10-28 12:27:55+00:00","605870872","Hankfera","2012-06-12 00:24:46+00:00","","80","488"
"144","2021-10-27 17:19:38+00:00","1216021318140821507","DualEffectGames","1453411077522341895","2021-10-28 12:23:11+00:00","256832878","LightNuss","2011-02-24 04:45:22+00:00","","41","98"
"145","2021-10-27 17:19:38+00:00","1216021318140821507","DualEffectGames","1453411077522341895","2021-10-28 06:17:19+00:00","805880838512660480","K_saintmichael","2016-12-05 21:05:39+00:00","","338","1420"
"146","2021-10-27 17:19:38+00:00","1216021318140821507","DualEffectGames","1453411077522341895","2021-10-28 03:10:50+00:00","1376576343530430464","shawnjazz1","2021-03-29 16:46:05+00:00","","167","1388"
"147","2021-10-27 17:19:38+00:00","1216021318140821507","DualEffectGames","1453411077522341895","2021-10-28 02:56:13+00:00","1072235064921079809","PanchoReview","2018-12-10 21:02:15+00:00","Santiago, Chile","139","37"
"148","2021-10-27 17:19:38+00:00","1216021318140821507","DualEffectGames","1453411077522341895","2021-10-28 02:53:42+00:00","1656501157","Eisuto_","2013-08-09 00:07:53+00:00","","215","3175"
"149","2021-10-27 17:19:38+00:00","1216021318140821507","DualEffectGames","1453411077522341895","2021-10-27 22:52:54+00:00","76610217","iJezabella","2009-09-23 10:26:08+00:00","Swansea, Wales","123","235"
"150","2021-10-27 17:19:38+00:00","1216021318140821507","DualEffectGames","1453411077522341895","2021-10-27 21:34:47+00:00","1069833478198517761","FishPale","2018-12-04 05:59:12+00:00","Inside your percolator","112","103"
"151","2021-10-27 17:19:38+00:00","1216021318140821507","DualEffectGames","1453411077522341895","2021-10-27 21:15:40+00:00","1269915393788907520","XidoleusEcho","2020-06-08 08:55:25+00:00","","63","758"
"152","2021-10-27 17:19:38+00:00","1216021318140821507","DualEffectGames","1453411077522341895","2021-10-27 20:09:42+00:00","1222216158637699072","JoffreyMeslet","2020-01-28 17:53:50+00:00","Le mans","1","15"
"153","2021-10-27 17:19:38+00:00","1216021318140821507","DualEffectGames","1453411077522341895","2021-10-27 18:22:10+00:00","1019874300","OptimusGinrai","2012-12-18 14:26:45+00:00","Orchard Park, NY","395","413"
"154","2021-10-27 17:19:38+00:00","1216021318140821507","DualEffectGames","1453411077522341895","2021-10-27 18:21:37+00:00","1370758272","KuraiGhoul","2013-04-21 23:15:54+00:00","From a place the world forgot","713","1033"
"155","2021-10-27 17:19:38+00:00","1216021318140821507","DualEffectGames","1453411077522341895","2021-10-27 17:50:20+00:00","954096582667911168","IslandZhero","2018-01-18 21:02:06+00:00","Indonesia","143","396"
"156","2021-10-27 17:19:38+00:00","1216021318140821507","DualEffectGames","1453411077522341895","2021-10-27 17:42:22+00:00","771254386668343296","IgarciaWorkout","2016-09-01 07:52:30+00:00","Ashina","550","573"
"157","2021-10-27 17:19:38+00:00","1216021318140821507","DualEffectGames","1453411077522341895","2021-10-27 17:34:55+00:00","1180603802","FFSgetout","2013-02-14 23:34:49+00:00","Somewhere Over The Rainbow","168","3702"
"158","2021-10-27 17:19:38+00:00","1216021318140821507","DualEffectGames","1453411077522341895","2021-10-27 17:27:26+00:00","345239724","andypearson86","2011-07-30 08:01:08+00:00","Sheffield, UK","592","241"
"159","2021-10-27 17:19:38+00:00","1216021318140821507","DualEffectGames","1453411077522341895","2021-10-27 17:23:03+00:00","14322133","DiegoMatias","2008-04-07 12:00:16+00:00","Cuiabá - MT","386","1138"
"160","2021-10-27 17:19:38+00:00","1216021318140821507","DualEffectGames","1453411077522341895","2021-10-27 17:21:51+00:00","764621922","Jon_Wolfoso","2012-08-17 23:10:48+00:00","Terra, Segmentum Solar.","227","925"
"161","2021-10-27 17:19:38+00:00","1216021318140821507","DualEffectGames","1453411077522341895","2021-10-27 17:21:35+00:00","1002936322787602432","faris199819","2018-06-02 15:33:47+00:00","","29","104"
"162","2021-10-27 17:19:38+00:00","1216021318140821507","DualEffectGames","1453411077522341895","2021-10-27 17:20:59+00:00","706978740","JoeJoePajor","2012-07-20 11:29:58+00:00","...in a simulation...","474","388"
"163","2021-10-27 17:19:38+00:00","1216021318140821507","DualEffectGames","1453411077522341895","2021-10-27 17:20:39+00:00","830852423535120384","DJRebirth","2017-02-12 18:53:49+00:00","Nebraska, USA","10302","4065"
"164","2021-10-27 17:19:38+00:00","1216021318140821507","DualEffectGames","1453411077522341895","2021-10-27 17:20:22+00:00","1433266796014931969","Zkam1988","2021-09-02 03:13:36+00:00","Gold Coast Australia ","55","322"
"165","2021-10-27 17:19:38+00:00","1216021318140821507","DualEffectGames","1453411077522341895","2021-10-27 17:20:03+00:00","470905518","BucketPls","2012-01-22 08:37:36+00:00","The Netherlands","516","763"
"166","2021-10-25 12:38:10+00:00","1216021318140821507","DualEffectGames","1452615466611056649","2021-11-05 22:01:56+00:00","1210518128","m4Ty_1995","2013-02-23 03:37:28+00:00","valparaiso, Quintero \\(*-*)//","81","2019"
"167","2021-10-25 12:38:10+00:00","1216021318140821507","DualEffectGames","1452615466611056649","2021-10-31 22:07:25+00:00","900523882670632960","SolidJano","2017-08-24 01:03:19+00:00","El Bosque, Chile","24","196"
"168","2021-10-25 12:38:10+00:00","1216021318140821507","DualEffectGames","1452615466611056649","2021-10-28 12:17:49+00:00","3600893001","Guxzero","2015-09-09 18:19:49+00:00","","48","262"
"169","2021-10-25 12:38:10+00:00","1216021318140821507","DualEffectGames","1452615466611056649","2021-10-27 20:33:26+00:00","1453459338866184197","KPHISTORYBUFF","2021-10-27 20:31:37+00:00","","10","25"
"170","2021-10-25 12:38:10+00:00","1216021318140821507","DualEffectGames","1452615466611056649","2021-10-26 19:28:16+00:00","153644529","marianoo221","2010-06-09 02:46:16+00:00","","262","101"
"171","2021-10-25 12:38:10+00:00","1216021318140821507","DualEffectGames","1452615466611056649","2021-10-26 15:43:14+00:00","912026653144047616","dougbarrett619","2017-09-24 18:51:13+00:00","parts unknow","144","625"
"172","2021-10-25 12:38:10+00:00","1216021318140821507","DualEffectGames","1452615466611056649","2021-10-26 11:20:28+00:00","1320701470602309632","ReCodeChels","2020-10-26 12:19:49+00:00","","36","94"
"173","2021-10-25 12:38:10+00:00","1216021318140821507","DualEffectGames","1452615466611056649","2021-10-26 07:03:29+00:00","2814025926","cyansomnia","2014-09-17 02:34:21+00:00","Oregon, USA","225","146"
"174","2021-10-25 12:38:10+00:00","1216021318140821507","DualEffectGames","1452615466611056649","2021-10-26 05:07:36+00:00","1259379142480584704","SailorMidgard","2020-05-10 07:06:23+00:00","","43","100"
"175","2021-10-25 12:38:10+00:00","1216021318140821507","DualEffectGames","1452615466611056649","2021-10-26 04:18:02+00:00","319842116","B_BerriosX_X","2011-06-18 20:59:58+00:00","chile","315","357"
"176","2021-10-25 12:38:10+00:00","1216021318140821507","DualEffectGames","1452615466611056649","2021-10-26 04:07:48+00:00","1392712908090580992","HelOmega","2021-05-13 05:27:15+00:00","","11","229"
"177","2021-10-25 12:38:10+00:00","1216021318140821507","DualEffectGames","1452615466611056649","2021-10-26 03:49:56+00:00","1108749838504595459","SantopotterCL","2019-03-21 15:18:55+00:00","","67","176"
"178","2021-10-25 12:38:10+00:00","1216021318140821507","DualEffectGames","1452615466611056649","2021-10-25 23:12:04+00:00","2800358853","deathhunter17","2014-10-02 17:08:42+00:00","between depression & ignorance","248","2666"
"179","2021-10-25 12:38:10+00:00","1216021318140821507","DualEffectGames","1452615466611056649","2021-10-25 21:28:17+00:00","2882691592","Galixtron","2014-11-18 14:24:38+00:00","Donostia","108","637"
"180","2021-10-25 12:38:10+00:00","1216021318140821507","DualEffectGames","1452615466611056649","2021-10-25 20:47:29+00:00","1433512400117026819","yharnamsnow","2021-09-02 19:29:47+00:00","Multiverso","10","249"
"181","2021-10-25 12:38:10+00:00","1216021318140821507","DualEffectGames","1452615466611056649","2021-10-25 20:34:09+00:00","1040268869158531072","Boy05527772","2018-09-13 16:00:00+00:00","Limburg, Nederland","4","65"
"182","2021-10-25 12:38:10+00:00","1216021318140821507","DualEffectGames","1452615466611056649","2021-10-25 20:14:43+00:00","1306710719686152192","villian_black","2020-09-17 21:45:21+00:00","","0","22"
"183","2021-10-25 12:38:10+00:00","1216021318140821507","DualEffectGames","1452615466611056649","2021-10-25 19:36:28+00:00","1102900341501095936","Ariesguy17","2019-03-05 11:55:07+00:00","","5","32"
"184","2021-10-25 12:38:10+00:00","1216021318140821507","DualEffectGames","1452615466611056649","2021-10-25 16:48:21+00:00","1253031938987831297","bullet_lost","2020-04-22 18:44:50+00:00","Portugal","75","224"
"185","2021-10-25 12:38:10+00:00","1216021318140821507","DualEffectGames","1452615466611056649","2021-10-25 15:14:03+00:00","289642817","AL_NEMESIS","2011-04-29 00:21:37+00:00","Hunucmá, Yucatán","40","929"
"186","2021-10-25 12:38:10+00:00","1216021318140821507","DualEffectGames","1452615466611056649","2021-10-25 14:48:53+00:00","770951003902533632","Nemesis199x","2016-08-31 11:46:57+00:00","","4","238"
"187","2021-10-25 12:38:10+00:00","1216021318140821507","DualEffectGames","1452615466611056649","2021-10-25 14:40:06+00:00","1156202032358940677","MrTusk__","2019-07-30 13:57:00+00:00","","5","90"
"188","2021-10-25 12:38:10+00:00","1216021318140821507","DualEffectGames","1452615466611056649","2021-10-25 14:39:07+00:00","1427468649896595456","LinkTheViking","2021-08-17 03:13:50+00:00","Asgard","144","80"
"189","2021-10-25 12:38:10+00:00","1216021318140821507","DualEffectGames","1452615466611056649","2021-10-25 13:20:58+00:00","911350985699807233","k3ioske","2017-09-22 22:06:21+00:00","Raccoon City","27","58"
"190","2021-10-25 12:38:10+00:00","1216021318140821507","DualEffectGames","1452615466611056649","2021-10-25 13:18:38+00:00","1358452783662460929","TheAresPhoenix","2021-02-07 16:29:29+00:00","Ireland ","68","851"
"191","2021-10-25 12:38:10+00:00","1216021318140821507","DualEffectGames","1452615466611056649","2021-10-25 13:13:42+00:00","135649769","dexter_stars","2010-04-21 22:33:56+00:00","Buenos Aires","156","402"
"192","2021-10-25 12:38:10+00:00","1216021318140821507","DualEffectGames","1452615466611056649","2021-10-25 13:07:25+00:00","33085220","AsherV20","2009-04-19 01:38:25+00:00","Philadelphia, PA","111","265"
"193","2021-10-25 12:38:10+00:00","1216021318140821507","DualEffectGames","1452615466611056649","2021-10-25 13:02:18+00:00","760182170044534784","SonicX2k0","2016-08-01 18:35:27+00:00","Washingtonville, NY","126","1078"
"194","2021-10-25 12:38:10+00:00","1216021318140821507","DualEffectGames","1452615466611056649","2021-10-25 13:01:40+00:00","1069833478198517761","FishPale","2018-12-04 05:59:12+00:00","Inside your percolator","112","103"
"195","2021-10-25 12:38:10+00:00","1216021318140821507","DualEffectGames","1452615466611056649","2021-10-25 12:49:14+00:00","345239724","andypearson86","2011-07-30 08:01:08+00:00","Sheffield, UK","592","241"
"196","2021-10-25 12:38:10+00:00","1216021318140821507","DualEffectGames","1452615466611056649","2021-10-25 12:49:11+00:00","770160545047650304","_bignono","2016-08-29 07:25:57+00:00","Middle East Coast","214","70"
"197","2021-10-25 12:38:10+00:00","1216021318140821507","DualEffectGames","1452615466611056649","2021-10-25 12:43:44+00:00","3815994912","AlfredVonErich","2015-10-07 16:33:50+00:00","Los Angeles, CA","177","610"
"198","2021-10-25 12:38:10+00:00","1216021318140821507","DualEffectGames","1452615466611056649","2021-10-25 12:41:05+00:00","89543332","kactuso","2009-11-12 21:18:14+00:00","Valparaíso, Chile","679","3166"
"199","2021-10-25 12:38:10+00:00","1216021318140821507","DualEffectGames","1452615466611056649","2021-10-25 12:40:14+00:00","177142181","Forsayk3nTTV","2010-08-11 10:33:16+00:00","England, Ipswich","500","444"
"200","2021-10-25 12:38:10+00:00","1216021318140821507","DualEffectGames","1452615466611056649","2021-10-25 12:39:42+00:00","1002936322787602432","faris199819","2018-06-02 15:33:47+00:00","","29","104"
"201","2021-10-25 12:38:10+00:00","1216021318140821507","DualEffectGames","1452615466611056649","2021-10-25 12:39:05+00:00","1224845122107514880","mayccoisa","2020-02-05 00:00:17+00:00","Curitiba","232","457"
"202","2021-10-25 12:38:10+00:00","1216021318140821507","DualEffectGames","1452615466611056649","2021-10-25 12:39:02+00:00","1891030758","NoirValkyrie7","2013-09-21 18:39:18+00:00"," ™","68","127"
"203","2021-10-25 12:38:10+00:00","1216021318140821507","DualEffectGames","1452615466611056649","2021-10-25 12:38:51+00:00","90620947","8myers8","2009-11-17 12:41:36+00:00","UK","9","197"
"204","2021-10-25 12:38:10+00:00","1216021318140821507","DualEffectGames","1452615466611056649","2021-10-25 12:38:23+00:00","1433266796014931969","Zkam1988","2021-09-02 03:13:36+00:00","Gold Coast Australia ","55","322"
"205","2021-10-23 17:42:55+00:00","1216021318140821507","DualEffectGames","1451967383808086017","2021-10-24 07:11:40+00:00","345239724","andypearson86","2011-07-30 08:01:08+00:00","Sheffield, UK","592","241"
"206","2021-10-23 17:42:55+00:00","1216021318140821507","DualEffectGames","1451967383808086017","2021-10-24 06:31:27+00:00","1433266796014931969","Zkam1988","2021-09-02 03:13:36+00:00","Gold Coast Australia ","55","322"
"207","2021-10-23 17:42:55+00:00","1216021318140821507","DualEffectGames","1451967383808086017","2021-10-23 18:47:58+00:00","2800358853","deathhunter17","2014-10-02 17:08:42+00:00","between depression & ignorance","248","2666"
"208","2021-10-15 17:17:30+00:00","1216021318140821507","DualEffectGames","1449061886654394372","2021-10-21 10:42:17+00:00","1194927432966561792","PQubeIndies","2019-11-14 10:38:01+00:00","London","10015","209"
"209","2021-10-15 17:17:30+00:00","1216021318140821507","DualEffectGames","1449061886654394372","2021-10-16 05:17:05+00:00","1092854292","lgupload01","2013-01-15 18:19:23+00:00","","74","27"
"210","2021-10-15 17:17:30+00:00","1216021318140821507","DualEffectGames","1449061886654394372","2021-10-16 04:24:10+00:00","1433266796014931969","Zkam1988","2021-09-02 03:13:36+00:00","Gold Coast Australia ","55","322"
"211","2021-10-15 17:17:30+00:00","1216021318140821507","DualEffectGames","1449061886654394372","2021-10-15 18:44:33+00:00","256832878","LightNuss","2011-02-24 04:45:22+00:00","","41","98"
"212","2021-10-15 17:17:30+00:00","1216021318140821507","DualEffectGames","1449061886654394372","2021-10-15 18:34:03+00:00","1302417234724294660","ScottyStunt","2020-09-06 01:24:15+00:00","","57","90"
"213","2021-10-15 17:17:30+00:00","1216021318140821507","DualEffectGames","1449061886654394372","2021-10-15 17:31:09+00:00","1316616853389746176","GNoctumbro","2020-10-15 05:48:22+00:00","","42","198"
