<deployment-project plugin="plugin.ezdeploy" plugin-version="1.0">
  <configuration build-checksum="596501916" file="C:\Users\Jannis\Desktop\HiWi Lmt\dav3e2-beta\DAVE.prj" location="C:\Users\Jannis\Desktop\HiWi Lmt\dav3e2-beta" name="DAVE" preferred-package-location="C:\Users\Jannis\Desktop\HiWi Lmt\dav3e2-beta\DAVE\for_redistribution" preferred-package-type="package.type.exe" target="target.ezdeploy.standalone" target-name="Application Compiler">
    <param.appname>DAVE</param.appname>
    <param.icon />
    <param.icons />
    <param.version>1.0</param.version>
    <param.authnamewatermark />
    <param.email />
    <param.company />
    <param.summary />
    <param.description />
    <param.screenshot />
    <param.guid />
    <param.installpath.string>\DAVE\</param.installpath.string>
    <param.installpath.combo>option.installpath.programfiles</param.installpath.combo>
    <param.logo />
    <param.install.notes />
    <param.target.install.notes />
    <param.intermediate>${PROJECT_ROOT}\DAVE\for_testing</param.intermediate>
    <param.files.only>${PROJECT_ROOT}\DAVE\for_redistribution_files_only</param.files.only>
    <param.output>${PROJECT_ROOT}\DAVE\for_redistribution</param.output>
    <param.logdir>${PROJECT_ROOT}\DAVE</param.logdir>
    <param.enable.clean.build>false</param.enable.clean.build>
    <param.user.defined.mcr.options />
    <param.embed.ctf>true</param.embed.ctf>
    <param.target.type>subtarget.standalone</param.target.type>
    <param.support.packages />
    <param.web.mcr>true</param.web.mcr>
    <param.package.mcr>false</param.package.mcr>
    <param.no.mcr>false</param.no.mcr>
    <param.web.mcr.name>MyAppInstaller_web</param.web.mcr.name>
    <param.package.mcr.name>MyAppInstaller_mcr</param.package.mcr.name>
    <param.no.mcr.name>MyAppInstaller_app</param.no.mcr.name>
    <param.windows.command.prompt>false</param.windows.command.prompt>
    <param.create.log>false</param.create.log>
    <param.log.file />
    <unset>
      <param.icon />
      <param.icons />
      <param.version />
      <param.authnamewatermark />
      <param.email />
      <param.company />
      <param.summary />
      <param.description />
      <param.screenshot />
      <param.guid />
      <param.installpath.string />
      <param.installpath.combo />
      <param.logo />
      <param.target.install.notes />
      <param.intermediate />
      <param.files.only />
      <param.output />
      <param.logdir />
      <param.enable.clean.build />
      <param.user.defined.mcr.options />
      <param.embed.ctf />
      <param.target.type />
      <param.support.packages />
      <param.web.mcr />
      <param.package.mcr />
      <param.no.mcr />
      <param.web.mcr.name />
      <param.package.mcr.name />
      <param.no.mcr.name />
      <param.create.log />
      <param.log.file />
    </unset>
    <fileset.main>
      <file>${PROJECT_ROOT}\DAVE.m</file>
    </fileset.main>
    <fileset.resources>
      <file>${PROJECT_ROOT}\+Gui</file>
      <file>${PROJECT_ROOT}\classes</file>
      <file>${PROJECT_ROOT}\functions</file>
      <file>${PROJECT_ROOT}\init.m</file>
      <file>${PROJECT_ROOT}\plugins</file>
      <file>${PROJECT_ROOT}\toolboxes</file>
      <file>C:\Users\Jannis\Documents\MATLAB\Add-Ons\Toolboxes\GUI Layout Toolbox</file>
    </fileset.resources>
    <fileset.package />
    <fileset.depfun>
      <file>${PROJECT_ROOT}\LICENSE</file>
    </fileset.depfun>
    <build-deliverables>
      <file location="${PROJECT_ROOT}\DAVE\for_testing" name="splash.png" optional="false">C:\Users\Jannis\Desktop\HiWi Lmt\dav3e2-beta\DAVE\for_testing\splash.png</file>
      <file location="${PROJECT_ROOT}\DAVE\for_testing" name="DAVE.exe" optional="false">C:\Users\Jannis\Desktop\HiWi Lmt\dav3e2-beta\DAVE\for_testing\DAVE.exe</file>
      <file location="${PROJECT_ROOT}\DAVE\for_testing" name="readme.txt" optional="true">C:\Users\Jannis\Desktop\HiWi Lmt\dav3e2-beta\DAVE\for_testing\readme.txt</file>
    </build-deliverables>
    <workflow />
    <matlab>
      <root>C:\Program Files\MATLAB\R2016b</root>
      <toolboxes>
        <toolbox name="fixedpoint" />
        <toolbox name="matlabcoder" />
        <toolbox name="matlabhdlcoder" />
        <toolbox name="embeddedcoder" />
      </toolboxes>
      <toolbox>
        <fixedpoint>
          <enabled>true</enabled>
        </fixedpoint>
      </toolbox>
      <toolbox>
        <matlabcoder>
          <enabled>true</enabled>
        </matlabcoder>
      </toolbox>
      <toolbox>
        <matlabhdlcoder>
          <enabled>true</enabled>
        </matlabhdlcoder>
      </toolbox>
      <toolbox>
        <embeddedcoder>
          <enabled>true</enabled>
        </embeddedcoder>
      </toolbox>
    </matlab>
    <platform>
      <unix>false</unix>
      <mac>false</mac>
      <windows>true</windows>
      <win2k>false</win2k>
      <winxp>false</winxp>
      <vista>false</vista>
      <linux>false</linux>
      <solaris>false</solaris>
      <osver>6.2</osver>
      <os32>false</os32>
      <os64>true</os64>
      <arch>win64</arch>
      <matlab>true</matlab>
    </platform>
  </configuration>
</deployment-project>