{
	"paquetes a instalar en nest": {
		"prefix": "mc-comandos-libreria-nst",
		"body": [
		  "npm i @manticore-labs/nest @nestjs/typeorm typeorm mysql @nestjs/graphql class-validator auth0 rxjs"
		],
		"description": "paquetes a instalar en nest"
	  },
	  "paquetes para angular": {
		"prefix": "mc-comandos-libreria-ng",
		"body": [
		  "npm i bootstrap primeng primeicons @angular/animations angular2-toaster @angular/material @manticore-labs/ng-api angular2-moment angular2-text-mask man-lab-ng popper.js"
		],
		"description": "paquetes para angular"
	  }
}