abilities: 9
ability: 1
able: 3
abode: 7
about: 1
above: 3
abroad: 1
absolute: 8
acceptance: 8
account: 2
active: 4
acuteness: 7
adapted: 4
add: 18
addition: 5
additions: 3
address: 2
adieus: 2
admiration: 8
admire: 4
admitted: 2
admitting: 7
advanced: 5
advantage: 2
advantages: 9
affection: 1
affixed: 5
afford: 3
affronting: 4
after: 2
again: 3
against: 4
age: 20
agreeable: 4
agreed: 3
agreement: 1
all: 12
allow: 4
allowance: 6
almost: 2
alone: 4
along: 3
alteration: 9
although: 9
always: 4
am: 54
amiable: 3
among: 4
amongst: 3
amounted: 4
ample: 1
an: 90
and: 44
announcing: 8
another: 3
answer: 7
answered: 4
anxious: 2
any: 20
apartments: 6
appear: 2
appearance: 4
appetite: 4
applauded: 4
are: 25
arise: 2
arranging: 4
arrival: 2
arrived: 4
article: 2
as: 88
ashamed: 1
ask: 22
asked: 3
assistance: 2
assurance: 8
assure: 1
assured: 4
astonished: 4
at: 74
attachment: 7
attacks: 3
attempt: 3
attempted: 3
attended: 5
attending: 3
attention: 3
avoid: 4
bachelor: 5
balls: 3
barton: 1
basket: 3
be: 34
beauty: 1
because: 5
bed: 18
been: 7
before: 4
began: 2
begin: 9
behaved: 2
behaviour: 4
behind: 4
being: 4
believe: 6
believed: 3
believing: 6
belonging: 6
beloved: 6
besides: 9
betrayed: 3
better: 3
between: 8
beyond: 3
blessing: 2
blind: 1
blush: 4
blushes: 1
body: 3
boisterous: 8
bore: 6
boy: 15
branch: 1
branched: 4
brandon: 3
breakfast: 8
bred: 7
breeding: 3
bringing: 8
brother: 5
brought: 1
building: 4
built: 4
burst: 2
busy: 5
but: 24
by: 43
call: 8
called: 1
calling: 11
calm: 2
can: 15
cannot: 4
carriage: 4
carried: 1
case: 4
cause: 4
cease: 4
celebrated: 9
certain: 1
certainly: 4
certainty: 7
chamber: 1
change: 3
chapter: 2
charm: 2
charmed: 2
cheered: 1
cheerful: 3
chicken: 5
chief: 3
child: 6
children: 6
china: 1
civil: 3
civility: 2
civilly: 6
clothes: 3
cold: 11
collected: 5
collecting: 7
colonel: 13
come: 3
comfort: 4
commanded: 10
common: 2
compact: 5
companions: 4
comparison: 7
compass: 4
compliment: 4
concealed: 2
concern: 2
concerns: 2
concluded: 6
conduct: 5
confined: 8
connection: 7
consider: 9
considered: 15
consisted: 6
consulted: 7
contained: 3
contempt: 5
contented: 2
continual: 4
continue: 3
continued: 5
continuing: 6
contrasted: 8
conveying: 3
conviction: 4
convinced: 2
cordial: 6
cordially: 4
cottage: 5
could: 4
country: 4
county: 7
course: 3
court: 8
cousin: 2
cousins: 1
covered: 1
cultivated: 8
curiosity: 5
danger: 2
dare: 4
dashwood: 6
dashwoods: 4
daughter: 5
daughters: 6
day: 18
deal: 3
dear: 7
dearest: 1
death: 6
debating: 2
decay: 2
decisively: 13
declared: 8
defective: 4
defer: 3
deficient: 5
dejection: 4
delay: 3
delicate: 3
delight: 2
delighted: 13
delightful: 4
delivered: 5
demands: 2
demesne: 10
denied: 1
denote: 2
denoting: 2
deny: 2
depart: 3
departure: 8
depend: 2
dependent: 5
depending: 8
described: 4
design: 4
desire: 3
desirous: 8
determine: 6
detract: 5
devonshire: 6
did: 12
differed: 4
difficult: 1
difficulty: 6
diminution: 5
dine: 6
dining: 2
direct: 5
direction: 4
directly: 2
discourse: 5
discovered: 10
discovery: 10
discretion: 5
dispatched: 7
disposal: 6
disposed: 5
disposing: 7
dissimilar: 8
dissuade: 3
distance: 4
distant: 1
distrusts: 6
diverted: 4
do: 84
does: 8
domestic: 4
door: 10
doors: 1
doubt: 4
doubtful: 3
down: 2
downs: 7
draw: 3
drawing: 3
drawings: 5
drew: 2
dried: 2
drift: 4
dull: 10
dwelling: 3
each: 3
eagerness: 6
early: 1
earnest: 4
earnestly: 4
easily: 4
easy: 3
eat: 20
ecstatic: 8
edward: 2
effect: 4
effects: 4
either: 6
elderly: 7
eldest: 2
elegance: 2
elinor: 7
elsewhere: 5
enable: 1
end: 15
endeavor: 7
engage: 1
engrossed: 10
enjoy: 2
enjoyed: 2
enjoyment: 1
enough: 5
enquire: 8
entered: 4
entirely: 6
entrance: 8
entreaties: 9
equal: 5
equally: 1
especially: 7
estate: 4
esteem: 11
esteems: 6
estimable: 3
estimating: 12
even: 7
evening: 4
event: 2
ever: 4
every: 3
everything: 11
evident: 3
evil: 2
examine: 1
excellence: 7
excellent: 3
except: 1
excited: 6
excuse: 5
exercise: 3
exertion: 3
exeter: 5
existence: 4
expect: 4
expense: 5
expenses: 5
explain: 2
explained: 9
exposed: 5
express: 1
expression: 10
exquisite: 6
extended: 5
extensive: 10
extent: 2
extremely: 6
extremity: 11
eyes: 3
face: 3
fact: 7
fail: 2
families: 2
family: 1
fanny: 7
far: 23
farther: 1
fat: 21
father: 5
favour: 2
favourable: 10
favourite: 3
feebly: 1
feel: 4
feeling: 2
feelings: 8
feet: 4
felicity: 5
felt: 4
females: 4
ferrars: 2
fertile: 5
few: 16
fifteen: 2
figure: 2
find: 3
fine: 5
finished: 5
first: 4
five: 4
followed: 4
folly: 5
fond: 1
for: 28
forbade: 1
forfeited: 8
form: 1
formal: 3
formed: 1
former: 1
formerly: 3
forming: 7
forth: 1
fortune: 2
forty: 2
found: 4
four: 13
frankness: 5
frequently: 5
friend: 2
friendly: 1
friends: 2
friendship: 9
from: 2
front: 3
fruit: 4
fulfilled: 5
full: 3
fully: 2
furnished: 4
furniture: 6
future: 1
game: 2
garden: 2
garret: 5
garrets: 5
gate: 6
gave: 5
gay: 17
general: 4
genius: 1
gentleman: 2
get: 15
give: 3
given: 5
giving: 6
going: 1
gone: 3
good: 4
goodness: 3
graceful: 4
grave: 2
gravity: 2
great: 4
greater: 2
greatest: 4
greatly: 5
green: 7
guest: 7
