object: 4
objection: 8
observe: 1
occasion: 4
occasional: 4
of: 81
off: 18
offence: 1
offended: 5
offending: 3
offer: 3
offered: 2
offering: 11
offices: 7
often: 4
oh: 36
old: 19
on: 86
one: 29
only: 3
open: 6
opinions: 9
oppose: 3
or: 43
order: 5
other: 4
others: 3
otherwise: 8
ought: 4
our: 16
ourselves: 5
out: 12
outlived: 3
outward: 2
outweigh: 12
over: 12
overcame: 5
own: 19
packages: 4
paid: 4
pain: 3
painful: 3
painted: 2
parish: 4
park: 7
parlors: 1
part: 4
partiality: 9
particular: 8
parties: 3
party: 3
passage: 8
passed: 3
past: 4
peculiar: 3
people: 5
perceive: 4
perceived: 12
perfectly: 2
performed: 2
perhaps: 7
period: 2
perpetual: 6
person: 3
pianoforte: 7
picture: 5
piqued: 4
place: 3
placing: 2
plan: 2
plate: 4
play: 7
played: 2
pleasant: 7
pleased: 1
pleasure: 10
plenty: 5
point: 4
pointed: 2
points: 4
polite: 5
poor: 1
position: 8
possession: 2
possible: 5
post: 5
power: 3
praise: 1
precaution: 2
preference: 6
preferred: 2
prepare: 1
prepared: 2
present: 2
preserved: 1
pretend: 1
pretended: 7
pretty: 4
prevailed: 2
principle: 5
principles: 4
private: 4
proceed: 3
procured: 5
procuring: 4
produce: 4
produced: 1
projecting: 8
projection: 16
promise: 2
promotion: 6
pronounce: 3
properly: 1
property: 8
proposal: 2
propriety: 8
prospect: 5
prosperous: 3
provided: 2
provision: 2
prudent: 3
pulled: 2
purse: 2
pursuit: 2
put: 23
questions: 5
quick: 3
quiet: 2
quit: 5
quitting: 3
raillery: 5
raising: 2
rank: 1
rapid: 6
raptures: 8
rapturous: 5
rather: 6
reached: 1
read: 3
ready: 1
real: 3
really: 5
reasonable: 5
reasonably: 7
received: 6
recommend: 7
recurred: 1
regard: 3
regret: 3
regular: 2
rejoiced: 2
related: 3
relation: 4
relied: 1
remain: 1
remainder: 6
remaining: 4
remark: 2
remarkably: 7
remember: 2
removal: 5
remove: 1
removed: 4
removing: 4
rendered: 4
rent: 4
repair: 1
repeated: 9
replied: 5
replying: 3
repulsive: 1
request: 3
required: 7
resembled: 1
reserved: 5
residence: 3
resolution: 5
resolve: 1
resolved: 1
resolving: 4
resources: 2
respect: 1
rest: 4
result: 7
returned: 7
rich: 2
right: 6
roof: 2
rooms: 1
rose: 5
round: 4
roused: 2
said: 6
sake: 5
same: 4
sang: 1
satisfied: 4
saved: 3
savings: 2
saw: 22
say: 13
scale: 11
scarcely: 1
screened: 7
season: 3
secure: 3
securing: 2
see: 9
seeing: 2
seemed: 1
seems: 8
seen: 4
sell: 2
sending: 1
sense: 8
sensible: 3
sent: 6
sentiments: 6
separate: 2
september: 6
servants: 2
service: 1
set: 16
settle: 3
settled: 3
settling: 5
seven: 6
several: 2
sex: 20
shade: 3
shall: 7
shameless: 3
share: 3
she: 49
shed: 6
shewing: 1
short: 3
shortly: 1
shot: 4
should: 1
show: 3
shutters: 2
shy: 14
shyness: 1
side: 1
sigh: 3
sight: 2
silent: 4
simple: 1
simplicity: 6
since: 5
sincerity: 6
sing: 4
sir: 23
sister: 3
sitting: 2
situation: 7
six: 20
sixteen: 1
size: 5
small: 3
smallest: 4
smallness: 7
smart: 2
smile: 2
smiling: 4
snug: 3
so: 107
sociable: 4
society: 2
sold: 6
solicitude: 4
solid: 1
some: 2
something: 7
sometimes: 5
son: 18
song: 2
songs: 5
sons: 4
soon: 6
sooner: 5
sorry: 3
speaking: 7
speedily: 4
spirit: 5
spite: 2
spoil: 6
spoke: 1
sportsman: 7
sportsmen: 8
spot: 4
square: 2
stairs: 3
stand: 7
stanhill: 7
started: 5
state: 2
staying: 4
steepest: 7
still: 6
stimulated: 3
stood: 6
strangers: 7
strictly: 1
striking: 2
stronger: 7
strongly: 2
studied: 2
stuff: 5
style: 11
subject: 5
subjects: 4
such: 4
sudden: 3
suffering: 7
sufficient: 5
suitable: 7
summer: 4
supply: 4
supported: 1
suppose: 4
supposing: 3
sure: 2
surprise: 4
surrounded: 9
suspected: 3
suspicion: 7
sussex: 1
sweetness: 4
sympathize: 6
table: 5
taken: 3
talent: 3
talked: 4
talking: 2
tall: 2
taste: 1
tastes: 1
tears: 5
tedious: 7
tell: 5
temper: 1
ten: 19
tended: 1
terminated: 8
terms: 3
than: 5
that: 4
the: 30
their: 5
theirs: 1
them: 2
themselves: 9
then: 6
there: 4
therefore: 4
these: 14
they: 9
thing: 4
things: 3
think: 8
thirty: 1
this: 2
thoroughly: 5
those: 7
though: 6
thought: 3
thoughts: 6
three: 1
through: 3
throwing: 7
thrown: 2
tiled: 2
till: 1
time: 5
timed: 1
times: 5
to: 80
together: 2
told: 1
tolerably: 7
too: 15
took: 3
total: 3
totally: 4
towards: 2
travelling: 11
trees: 2
tried: 6
trifling: 10
true: 3
truth: 5
twenty: 4
two: 17
unable: 2
unaffected: 9
uncivil: 3
uncommonly: 3
under: 1
understood: 4
uneasy: 5
unfeeling: 7
unknown: 5
unpacked: 9
unpleasant: 3
unpleasing: 4
unreserved: 16
unsatiable: 17
unwilling: 3
up: 54
upon: 6
use: 13
