[
  {
    "title": "Setting The Map Extent",
    "children": [
      {
        "id": "ThinkGeo.UI.WinForms.HowDoI.BasicNavigationSample",
        "title": "Basic Navigation",
        "description": "Learn how to use code to zoom, pan, and rotate the map control.",
        "source": "Samples/SettingMapExtent/BasicNavigationSample"
      },
      {
        "id": "ThinkGeo.UI.WinForms.HowDoI.SetMapExtentSample",
        "title": "Set the Map Extent",
        "description": "Learn how to set the map extent in a variety of different ways.",
        "source": "Samples/SettingMapExtent/SetMapExtentSample"
      }
    ]
  },
  {
    "title": "Displaying Layers",
    "children": [
      {
        "id": "ThinkGeo.UI.WinForms.HowDoI.ShapefileLayerSample",
        "title": "Display a Shapefile Layer",
        "description": "This sample shows how to display a shapefile layer.",
        "source": "Samples/DisplayingLayers/Vector/ShapefileLayerSample"
      },
      {
        "id": "ThinkGeo.UI.WinForms.HowDoI.FileGeoDatabaseLayerSample",
        "title": "Display a FileGeoDatabase Layer",
        "description": "This sample shows how to display a file geodatabase layer.",
        "source": "Samples/DisplayingLayers/Vector/FileGeoDatabaseLayerSample"
      },
      {
        "id": "ThinkGeo.UI.WinForms.HowDoI.TinyGeoLayerSample",
        "title": "Display a TinyGeo Layer",
        "description": "This sample shows how to display a TinyGeo layer.",
        "source": "Samples/DisplayingLayers/Vector/TinyGeoLayerSample"
      },
      {
        "id": "ThinkGeo.UI.WinForms.HowDoI.S57LayerSample",
        "title": "Display a S57 (Nautical Charts) Layer",
        "description": "This sample shows how to display S57 nautical charts.",
        "source": "Samples/DisplayingLayers/Vector/S57LayerSample"
      },
      {
        "id": "ThinkGeo.UI.WinForms.HowDoI.GPXLayerSample",
        "title": "Display a GPX Layer",
        "description": "This sample shows how to display a GPX layer.",
        "source": "Samples/DisplayingLayers/Vector/GPXLayerSample"
      },
      {
        "id": "ThinkGeo.UI.WinForms.HowDoI.TABLayerSample",
        "title": "Display a TAB Layer",
        "description": "This sample shows how to display a TAB layer.",
        "source": "Samples/DisplayingLayers/Vector/TABLayerSample"
      },
      {
        "id": "ThinkGeo.UI.WinForms.HowDoI.ISOLineLayerSample",
        "title": "Display an ISOLine Layer",
        "description": "This sample shows how to display an ISOLine layer.",
        "source": "Samples/DisplayingLayers/Vector/ISOLineLayerSample"
      },
      {
        "id": "ThinkGeo.UI.WinForms.HowDoI.InMemoryLayerSample",
        "title": "Display an InMemory Layer",
        "description": "This sample shows how to display an in memory layer.",
        "source": "Samples/DisplayingLayers/Vector/InMemoryLayerSample"
      },
      {
        "id": "ThinkGeo.UI.WinForms.HowDoI.GraticuleLayerSample",
        "title": "Display a Graticule Layer",
        "description": "This sample shows how to display a graticule line layer.",
        "source": "Samples/DisplayingLayers/Vector/GraticuleLayerSample"
      },
      {
        "id": "ThinkGeo.UI.WinForms.HowDoI.SQLiteLayerSample",
        "title": "Display a SQLite Layer",
        "description": "This sample shows how to display a SQLite layer.",
        "source": "Samples/DisplayingLayers/Database/SQLiteLayerSample"
      },
      {
        "id": "ThinkGeo.UI.WinForms.HowDoI.PostgresLayerSample",
        "title": "Display a Postgres Layer",
        "description": "This sample shows how to display a Postgres layer.",
        "source": "Samples/DisplayingLayers/Database/PostgresLayerSample"
      },
      {
        "id": "ThinkGeo.UI.WinForms.HowDoI.OracleLayerSample",
        "title": "Display an Oracle Layer",
        "description": "This sample shows how to display a Oracle layer.",
        "source": "Samples/DisplayingLayers/Database/OracleLayerSample"
      },
      {
        "id": "ThinkGeo.UI.WinForms.HowDoI.SQLServerLayerSample",
        "title": "Display a SQL Server Layer",
        "description": "This sample shows how to display a SQL Server layer.",
        "source": "Samples/DisplayingLayers/Database/SQLServerLayerSample"
      },
      {
        "id": "ThinkGeo.UI.WinForms.HowDoI.NOAARadarLayerSample",
        "title": "Display a NOAA Radar Layer (TODO)",
        "description": "This sample shows how to add NOAA Radar weather to your map.",
        "source": "Samples/DisplayingLayers/WebServices/NOAARadarLayerSample"
      },
      {
        "id": "ThinkGeo.UI.WinForms.HowDoI.NOAAWeatherStationLayerSample",
        "title": "Display a NOAA Weather Station Layer",
        "description": "This sample shows how to display NOAA weather stations current readings to your map.",
        "source": "Samples/DisplayingLayers/WebServices/NOAAWeatherStationLayerSample"
      },
      {
        "id": "ThinkGeo.UI.WinForms.HowDoI.NOAAWeatherWarningLayerSample",
        "title": "Display a NOAA Weather Warning Layer (TODO)",
        "description": "This sample shows how to display NOAA weather warnings to your map.",
        "source": "Samples/DisplayingLayers/WebServices/NOAAWeatherWarningLayerSample"
      },
      {
        "id": "ThinkGeo.UI.WinForms.HowDoI.CloudMapsRasterLayerSample",
        "title": "Display a Cloud Maps Raster Layer",
        "description": "This sample shows how to display ThinkGeo cloud raster background images.",
        "source": "Samples/DisplayingLayers/WebServices/CloudMapsRasterLayerSample"
      },
      {
        "id": "ThinkGeo.UI.WinForms.HowDoI.CloudMapsVectorLayerSample",
        "title": "Display a Cloud Maps Vector Layer",
        "description": "This sample shows how to display ThinkGeo cloud vector background maps.",
        "source": "Samples/DisplayingLayers/WebServices/CloudMapsVectorLayerSample"
      },
      {
        "id": "ThinkGeo.UI.WinForms.HowDoI.OfflineCloudMapsVectorLayerSample",
        "title": "Display a Cloud Maps Vector Layer Off-line",
        "description": "This sample show how to use an off-line version of ThinkGeo Cloud Map Vector data.",
        "source": "Samples/DisplayingLayers/Vector/OfflineCloudMapsVectorLayerSample"
      },
      {
        "id": "ThinkGeo.UI.WinForms.HowDoI.BingMapLayerSample",
        "title": "Display a Bing Map Layer",
        "description": "This sample shows how to display a Bing Maps layer.",
        "source": "Samples/DisplayingLayers/WebServices/BingMapLayerSample"
      },
      {
        "id": "ThinkGeo.UI.WinForms.HowDoI.GoogleMapLayerSample",
        "title": "Display a Google Map Layer",
        "description": "This sample shows how to display a Google Maps layer.",
        "source": "Samples/DisplayingLayers/WebServices/GoogleMapLayerSample"
      },
      {
        "id": "ThinkGeo.UI.WinForms.HowDoI.OpenStreetMapLayerSample",
        "title": "Display an OpenStreetMap Layer",
        "description": "This sample shows how to display a Open Street Maps layer.",
        "source": "Samples/DisplayingLayers/WebServices/OpenStreetMapLayerSample"
      },
      {
        "id": "ThinkGeo.UI.WinForms.HowDoI.WMSLayerSample",
        "title": "Display a WMS Layer",
        "description": "This sample shows how to display a WMS layer. (This sample may be slow as we use a public WMS sever)",
        "source": "Samples/DisplayingLayers/WebServices/WMSLayerSample"
      },
      {
        "id": "ThinkGeo.UI.WinForms.HowDoI.ECWLayerSample",
        "title": "Display an ECW Layer",
        "description": "This sample shows how to display a ECW image.",
        "source": "Samples/DisplayingLayers/Raster/ECWLayerSample"
      },
      {
        "id": "ThinkGeo.UI.WinForms.HowDoI.GeoTiffLayerSample",
        "title": "Display a GeoTiff Layer",
        "description": "This sample shows how to display a GeoTiff image.",
        "source": "Samples/DisplayingLayers/Raster/GeoTiffLayerSample"
      },
      {
        "id": "ThinkGeo.UI.WinForms.HowDoI.MrSidLayerSample",
        "title": "Display a MrSid Layer",
        "description": "This sample shows how to display a MrSids layer.",
        "source": "Samples/DisplayingLayers/Raster/MrSidLayerSample"
      },
      {
        "id": "ThinkGeo.UI.WinForms.HowDoI.ESRIGridLayerSample",
        "title": "Display a ESRI Grid Layer",
        "description": "This sample shows how to display a ESRI grid layer.",
        "source": "Samples/DisplayingLayers/Raster/ESRIGridLayerSample"
      },
      {
        "id": "ThinkGeo.UI.WinForms.HowDoI.CommonRasterLayersSample",
        "title": "Display Common Raster Layers",
        "description": "This sample shows how to display common images types such as PNG, JPEG, Bitmap etc.",
        "source": "Samples/DisplayingLayers/Raster/CommonRasterLayersSample"
      },
      {
        "id": "ThinkGeo.UI.WinForms.HowDoI.JPEG2000LayerSample",
        "title": "Display a JPEG2000 Layer",
        "description": "This sample shows how to display a JPEG2000 image.",
        "source": "Samples/DisplayingLayers/Raster/JPEG2000LayerSample"
      },
      {
        "id": "ThinkGeo.UI.WinForms.HowDoI.GenerateMapImageSample",
        "title": "Generate a Map as an Image",
        "description": "This sample shows how to draw your map onto an image file",
        "source": "Samples/DisplayingLayers/GenerateMapImageSample"
      }
    ]
  },
  {
    "title": "Using Overlays",
    "children": [
      {
        "id": "ThinkGeo.UI.WinForms.HowDoI.RefreshDynamicItemsSample",
        "title": "Refreshing Dynamic Items",
        "description": "Learn how to use overlays to display dynamically refreshing data. This sample will shows how to refresh 20,000 polygons every seconds.",
        "source": "Samples/UsingOverlays/RefreshDynamicItemsSample"
      },
      {
        "id": "ThinkGeo.UI.WinForms.HowDoI.CachingMapTilesSample",
        "title": "Caching Map Tiles",
        "description": "Learn how to cache map tiles. Caching tiles on an Overlay allows you to store images of rendered areas on the local disk and reuse them for faster rendering times. Saved tile images can be found in the cache folder within this project's debug folder.",
        "source": "Samples/UsingOverlays/CachingMapTilesSample"
      },
      {
        "id": "ThinkGeo.UI.WinForms.HowDoI.DrawGPSLocationOverlaySample",
        "title": "Draw GPS Location Overlay Sample",
        "description": "Learn how to display a GPS vehicle's movements in real-time",
        "source": "Samples/UsingOverlays/DrawGPSLocationOverlaySample"
      },
      {
        "id": "ThinkGeo.UI.WinForms.HowDoI.DisplaySimpleBackgroundOverlaySample",
        "title": "Display Simple Background Overlay",
        "description": "Learn how to display a background overlay",
        "source": "Samples/UsingOverlays/DisplaySimpleBackgroundOverlaySample"
      },
      {
        "id": "ThinkGeo.UI.WinForms.HowDoI.DisplayBingMapsOverlaySample",
        "title": "Display Bing Maps Overlay",
        "description": "Learn to render Bing Maps using the BingMapsOverlay. A valid Bing Maps ApplicationID is required. Visit the Bing Maps Dev Portal to sign up for a key (https://www.bingmapsportal.com/).",
        "source": "Samples/UsingOverlays/DisplayBingMapsOverlaySample"
      },
      {
        "id": "ThinkGeo.UI.WinForms.HowDoI.DisplayCloudMapsRasterOverlaySample",
        "title": "Display Cloud Maps Raster Overlay",
        "description": "Learn to render ThinkGeo Cloud Maps in raster format. Sign up for your own ThinkGeo Cloud API key at https://cloud.thinkgeo.com!",
        "source": "Samples/UsingOverlays/DisplayCloudMapsRasterOverlaySample"
      },
      {
        "id": "ThinkGeo.UI.WinForms.HowDoI.DisplayCloudMapsVectorOverlaySample",
        "title": "Display Cloud Maps Vector Overlay",
        "description": "Learn to render ThinkGeo Cloud Maps in vector format. Sign up for your own ThinkGeo Cloud API key at https://cloud.thinkgeo.com!",
        "source": "Samples/UsingOverlays/DisplayCloudMapsVectorOverlaySample"
      },
      {
        "id": "ThinkGeo.UI.WinForms.HowDoI.DisplayGoogleMapsOverlaySample",
        "title": "Display Google Maps Overlay",
        "description": "Learn to render Google Maps using the GoogleMapsOverlay. A Google Maps API key and secret is required. Visit the Google Maps Platform page to sign up for a key (https://cloud.google.com/maps-platform/).",
        "source": "Samples/UsingOverlays/DisplayGoogleMapsOverlaySample"
      },
      {
        "id": "ThinkGeo.UI.WinForms.HowDoI.DisplayOpenStreetMapOverlaySample",
        "title": "Display OpenStreetMap Overlay",
        "description": "Learn to render OpenStreetMap using the OpenStreetMapOverlay. OpenStreetMap Tiles are not meant for heavy production use without express permission from the OpenStreetMap Foundation. See https://operations.osmfoundation.org/ for details about their usage policies.",
        "source": "Samples/UsingOverlays/DisplayOpenStreetMapOverlaySample"
      },
      {
        "id": "ThinkGeo.UI.WinForms.HowDoI.DisplayWMSOverlaySample",
        "title": "Display a WMS Overlay",
        "description": "Learn to render a Web Map Service using the WMSOverlay. Please be aware that this is a publicly available WMS server and it may be slow to load.",
        "source": "Samples/UsingOverlays/DisplayWMSOverlaySample"
      },
      {
        "id": "ThinkGeo.UI.WinForms.HowDoI.DrawEditDeleteShapesUsingInteractiveOverlaySample",
        "title": "Draw, Edit, or Delete Shapes using the InteractiveOverlay",
        "description": "Learn to draw, edit, or delete shapes using the map's TrackOverlay and EditOverlay.",
        "source": "Samples/UsingOverlays/DrawEditDeleteShapesUsingInteractiveOverlaySample"
      },
      {
        "id": "ThinkGeo.UI.WinForms.HowDoI.GroupingLayersUsingLayerOverlaySample",
        "title": "Grouping Layers Using LayerOverlay",
        "description": "Learn to group layers into logical groups using LayerOverlays.",
        "source": "Samples/UsingOverlays/GroupingLayersUsingLayerOverlaySample"
      },
      {
        "id": "ThinkGeo.UI.WinForms.HowDoI.PrintMapsUsingPrintOverlaySample",
        "title": "Print Maps Using PrintOverlay",
        "description": "Learn to print maps using the PrintOverlay.",
        "source": "Samples/UsingOverlays/PrintMapsUsingPrintOverlaySample"
      },
      {
        "id": "ThinkGeo.UI.WinForms.HowDoI.UsingMarkersSample",
        "title": "Using Markers",
        "description": "Learn to add, edit, or remove markers on the map using the MarkerOverlay.",
        "source": "Samples/UsingOverlays/UsingMarkersSample"
      },
      {
        "id": "ThinkGeo.UI.WinForms.HowDoI.UsingPopupsSample",
        "title": "Using Popups",
        "description": "Learn to add, edit, or remove popups on the map using the PopupOverlay.",
        "source": "Samples/UsingOverlays/UsingPopupsSample"
      }
    ]
  },
  {
    "title": "Using Map Tools",
    "children": [
      {
        "id": "ThinkGeo.UI.WinForms.HowDoI.DisplayMapLogoSample",
        "title": "Display a Logo Adornment",
        "description": "Learn to render a custom logo on the map.",
        "source": "Samples/UsingMapTools/DisplayMapLogoSample"
      },
      {
        "id": "ThinkGeo.UI.WinForms.HowDoI.DisplayMapMouseCoordinatesSample",
        "title": "Display Map Mouse Coordinates",
        "description": "Learn to render coordinate info based on the mouse cursor position on the map.",
        "source": "Samples/UsingMapTools/DisplayMapMouseCoordinatesSample"
      },
      {
        "id": "ThinkGeo.UI.WinForms.HowDoI.DisplayMapScaleLineSample",
        "title": "Display a Map ScaleLine",
        "description": "Learn to render a ScaleLine on the map in a variety of different of styles.",
        "source": "Samples/UsingMapTools/DisplayMapScaleLineSample"
      },
      {
        "id": "ThinkGeo.UI.WinForms.HowDoI.DisplayMapPanZoomBarSample",
        "title": "Display a Map PanZoomBar",
        "description": "Learn to render a PanZoomBar on the map.",
        "source": "Samples/UsingMapTools/DisplayMapPanZoomBarSample"
      }
    ]
  },
  {
    "title": "Creating Styles",
    "children": [
      {
        "id": "ThinkGeo.UI.WinForms.HowDoI.CreatePointStyleSample",
        "title": "Create a Point Style",
        "description": "Learn how to style point data using a PointStyle",
        "source": "Samples/CreatingStyles/CreatePointStyleSample"
      },
      {
        "id": "ThinkGeo.UI.WinForms.HowDoI.CreateLineStyleSample",
        "title": "Create a Line Style",
        "description": "Learn how to style line data using a LineStyle",
        "source": "Samples/CreatingStyles/CreateLineStyleSample"
      },
      {
        "id": "ThinkGeo.UI.WinForms.HowDoI.CreateAreaStyleSample",
        "title": "Create an Area Style",
        "description": "Learn how to style polygon data using an AreaStyle",
        "source": "Samples/CreatingStyles/CreateAreaStyleSample"
      },
      {
        "id": "ThinkGeo.UI.WinForms.HowDoI.CreateTextStyleSample",
        "title": "Create a Text Style",
        "description": "Learn how to label data using a TextStyle",
        "source": "Samples/CreatingStyles/CreateTextStyleSample"
      },
      {
        "id": "ThinkGeo.UI.WinForms.HowDoI.CreateRegexStyleSample",
        "title": "Create Regex Style",
        "description": "Learn how to style polygons based on numeric data values",
        "source": "Samples/CreatingStyles/CreateRegexStyleSample"
      },
      {
        "id": "ThinkGeo.UI.WinForms.HowDoI.CreateDotDensityStyleSample",
        "title": "Create Dot Density Style",
        "description": "Learn how to style select features using regex expressions",
        "source": "Samples/CreatingStyles/CreateDotDensityStyleSample"
      },
      {
        "id": "ThinkGeo.UI.WinForms.HowDoI.CreateFilterStyleSample",
        "title": "Create a Filter Style",
        "description": "Learn how to selectively style features using a FilterStyle",
        "source": "Samples/CreatingStyles/CreateFilterStyleSample"
      },
      {
        "id": "ThinkGeo.UI.WinForms.HowDoI.CreateHeatStyleSample",
        "title": "Create a Heat Style",
        "description": "Learn how to create a heat map from data using a HeatStyle",
        "source": "Samples/CreatingStyles/CreateHeatStyleSample"
      },
      {
        "id": "ThinkGeo.UI.WinForms.HowDoI.CreateClusterPointStyleSample",
        "title": "Create a Cluster Style",
        "description": "Learn how to cluster point data dynamically using a ClusterPointStyle",
        "source": "Samples/CreatingStyles/CreateClusterPointStyleSample"
      },
      {
        "id": "ThinkGeo.UI.WinForms.HowDoI.CreateClassBreakStyleSample",
        "title": "Create a ClassBreak Style",
        "description": "Learn how to style data based on numeric values using a ClassBreakStyle",
        "source": "Samples/CreatingStyles/CreateHeatStyleSample"
      },
      {
        "id": "ThinkGeo.UI.WinForms.HowDoI.CreateValueStyleSample",
        "title": "Create a Value Style",
        "description": "Learn how to style data based on data values using a ValueStyle",
        "source": "Samples/CreatingStyles/CreateValueStyleSample"
      },
      {
        "id": "ThinkGeo.UI.WinForms.HowDoI.StylingAcrossMultipleScales",
        "title": "Styling Across Multiple Scales",
        "description": "Learn how to style layers across multiple scales using different styles assigned to different ZoomLevels",
        "source": "Samples/CreatingStyles/StylingAcrossMultipleScales"
      }
    ]
  },
  {
    "title": "Projecting Data",
    "children": [
      {
        "id": "ThinkGeo.UI.WinForms.HowDoI.SetLayerProjectionSample",
        "title": "Setting the Projection of a Layer",
        "description": "Learn how to automatically reproject a layer using the ProjectionConverter class",
        "source": "Samples/ProjectingData/SetLayerProjectionSample"
      },
      {
        "id": "ThinkGeo.UI.WinForms.HowDoI.WorldProjectionSample",
        "title": "World Projection Sample",
        "description": "A small collection of some interesting projections",
        "source": "Samples/ProjectingData/WorldProjectionSample"
      },
      {
        "id": "ThinkGeo.UI.WinForms.HowDoI.ProjectLatLonCoordinatesSample",
        "title": "Projecting Features",
        "description": "Learn how to reproject features using the ProjectionConverter class",
        "source": "Samples/ProjectingData/ProjectLatLonCoordinatesSample"
      }
    ]
  },
  {
    "title": "Performing Geometric Operations",
    "children": [
      {
        "id": "ThinkGeo.UI.WinForms.HowDoI.UnionShapesSample",
        "title": "Union Shapes",
        "description": "Learn how to union shapes into a single shape",
        "source": "Samples/PerformingGeometricOperations/UnionShapesSample"
      },
      {
        "id": "ThinkGeo.UI.WinForms.HowDoI.BufferShapeSample",
        "title": "Buffer Shape",
        "description": "Learn how to buffer a shape",
        "source": "Samples/PerformingGeometricOperations/BufferShapeSample"
      },
      {
        "id": "ThinkGeo.UI.WinForms.HowDoI.SimplifyShapeSample",
        "title": "Simplify Shape",
        "description": "Learn how to simplify a shape's geometry",
        "source": "Samples/PerformingGeometricOperations/SimplifyShapeSample"
      },
      {
        "id": "ThinkGeo.UI.WinForms.HowDoI.RotateShapeSample",
        "title": "Rotate Shape",
        "description": "Learn how to rotate a shape",
        "source": "Samples/PerformingGeometricOperations/RotateShapeSample"
      },
      {
        "id": "ThinkGeo.UI.WinForms.HowDoI.ScaleShapeSample",
        "title": "Scale Shape",
        "description": "Learn how to scale a shape",
        "source": "Samples/PerformingGeometricOperations/ScaleShapeSample"
      },
      {
        "id": "ThinkGeo.UI.WinForms.HowDoI.TranslateShapeSample",
        "title": "Translate Shape",
        "description": "Learn how to translate a shape",
        "source": "Samples/PerformingGeometricOperations/TranslateShapeSample"
      },
      {
        "id": "ThinkGeo.UI.WinForms.HowDoI.CalculateCenterPointSample",
        "title": "Calculate Center Point",
        "description": "Learn how to calculate the center point of a feature",
        "source": "Samples/PerformingGeometricOperations/CalculateCenterPointSample"
      },
      {
        "id": "ThinkGeo.UI.WinForms.HowDoI.CalculateAreaSample",
        "title": "Calculate Area",
        "description": "Learn how to calculate the area of a feature",
        "source": "Samples/PerformingGeometricOperations/CalculateAreaSample"
      },
      {
        "id": "ThinkGeo.UI.WinForms.HowDoI.CalculateLengthSample",
        "title": "Calculate Length",
        "description": "Learn how to calculate the length of a line",
        "source": "Samples/PerformingGeometricOperations/CalculateLengthSample"
      },
      {
        "id": "ThinkGeo.UI.WinForms.HowDoI.CalculateShortestLineBetweenShapesSample",
        "title": "Calculate Shortest Line Between Shapes",
        "description": "Learn how to calculate the shortest line between two shapes",
        "source": "Samples/PerformingGeometricOperations/CalculateShortestLineBetweenShapesSample"
      },
      {
        "id": "ThinkGeo.UI.WinForms.HowDoI.GetLineOnALineSample",
        "title": "Get Line on a Line",
        "description": "Learn how to get part of a line from an existing line",
        "source": "Samples/PerformingGeometricOperations/GetLineOnALineSample"
      },
      {
        "id": "ThinkGeo.UI.WinForms.HowDoI.ClipShapeSample",
        "title": "Clip Shape",
        "description": "Learn how to clip a shape from another shape",
        "source": "Samples/PerformingGeometricOperations/ClipShapeSample"
      },
      {
        "id": "ThinkGeo.UI.WinForms.HowDoI.DifferenceShapesSample",
        "title": "Difference Shapes",
        "description": "Learn how to find the difference of shapes",
        "source": "Samples/PerformingGeometricOperations/DifferenceShapesSample"
      },
      {
        "id": "ThinkGeo.UI.WinForms.HowDoI.GetConvexHullSample",
        "title": "Get Convex Hull",
        "description": "Learn how to get the convex hull of a shape",
        "source": "Samples/PerformingGeometricOperations/GetConvexHullSample"
      },
      {
        "id": "ThinkGeo.UI.WinForms.HowDoI.GetEnvelopeSample",
        "title": "Get Envelope",
        "description": "Learn how to get the envelope of a shape",
        "source": "Samples/PerformingGeometricOperations/GetEnvelopeSample"
      }
    ]
  },
  {
    "title": "Using Query Tools",
    "children": [
      {
        "id": "ThinkGeo.UI.WinForms.HowDoI.ContainsSample",
        "title": "Check if Feature Contains",
        "description": "Learn how to use layer query tools to find which features in a layer contain a shape",
        "source": "Samples/UsingQueryTools/ContainsSample"
      },
      {
        "id": "ThinkGeo.UI.WinForms.HowDoI.CrossesSample",
        "title": "Check if Feature Crosses",
        "description": "Learn how to use layer query tools to find which features in a layer a shape crosses",
        "source": "Samples/UsingQueryTools/CrossesSample"
      },
      {
        "id": "ThinkGeo.UI.WinForms.HowDoI.DisjointSample",
        "title": "Check if Features are Disjoint",
        "description": "Learn how to use layer query tools to find which features in a layer are disjoint from a shape",
        "source": "Samples/UsingQueryTools/DisjointSample"
      },
      {
        "id": "ThinkGeo.UI.WinForms.HowDoI.EqualsSample",
        "title": "Check if Features are Equal",
        "description": "Learn how to use layer query tools to find which features in a layer are topologically equal to a shape",
        "source": "Samples/UsingQueryTools/EqualsSample"
      },
      {
        "id": "ThinkGeo.UI.WinForms.HowDoI.IntersectsSample",
        "title": "Check if Feature Intersects",
        "description": "Learn how to use layer query tools to find which features in a layer intersect a shape",
        "source": "Samples/UsingQueryTools/IntersectsSample"
      },
      {
        "id": "ThinkGeo.UI.WinForms.HowDoI.OverlapsSample",
        "title": "Check if Feature Overlaps",
        "description": "Learn how to use layer query tools to find which features in a layer overlap a shape",
        "source": "Samples/UsingQueryTools/OverlapsSample"
      },
      {
        "id": "ThinkGeo.UI.WinForms.HowDoI.TouchesSample",
        "title": "Check if Feature Touches",
        "description": "Learn how to use layer query tools to find which features in a layer are touching a shape",
        "source": "Samples/UsingQueryTools/TouchesSample"
      },
      {
        "id": "ThinkGeo.UI.WinForms.HowDoI.WithinSample",
        "title": "Check if Feature is Within Another Feature",
        "description": "Learn how to use layer query tools to find which features in a layer are within a shape",
        "source": "Samples/UsingQueryTools/WithinSample"
      },
      {
        "id": "ThinkGeo.UI.WinForms.HowDoI.GetFeaturesWithinDistanceSample",
        "title": "Get Features Within a Distance",
        "description": "Learn how to use layer query tools to find features in a layer within a given distance of a point",
        "source": "Samples/UsingQueryTools/GetFeaturesWithinDistanceSample"
      },
      {
        "id": "ThinkGeo.UI.WinForms.HowDoI.GetAllFeatureDataSample",
        "title": "Get Data from All Features",
        "description": "Learn how to get data from all features in a ShapeFile",
        "source": "Samples/UsingQueryTools/GetAllFeatureDataSample"
      },
      {
        "id": "ThinkGeo.UI.WinForms.HowDoI.GetDataFromFeatureSample",
        "title": "Get Data from One Feature",
        "description": "Learn how to get data from a feature in a ShapeFile",
        "source": "Samples/UsingQueryTools/GetDataFromFeatureSample"
      }
    ]
  },
  {
    "title": "Topological Validation",
    "children": [
      {
        "id": "ThinkGeo.UI.WinForms.HowDoI.PointValidationSample",
        "title": "Validate Point Topology",
        "description": "Learn how to use the TopologyValidator APIs to perform validation on points",
        "source": "Samples/TopologicalValidation/PointValidationSample"
      },
      {
        "id": "ThinkGeo.UI.WinForms.HowDoI.LineValidationSample",
        "title": "Validate Line Topology",
        "description": "Learn how to use the TopologyValidator APIs to perform validation on lines",
        "source": "Samples/TopologicalValidation/LineValidationSample"
      },
      {
        "id": "ThinkGeo.UI.WinForms.HowDoI.PolygonValidationSample",
        "title": "Validate Polygon Topology",
        "description": "Learn how to use the TopologyValidator APIs to perform validation on polygons",
        "source": "Samples/TopologicalValidation/PolygonValidationSample"
      }
    ]
  },
  {
    "title": "Using Cloud Maps Services",
    "children": [
      {
        "id": "ThinkGeo.UI.WinForms.HowDoI.RoutingCloudServicesSample",
        "title": "Routing",
        "description": "Learn how to use the RoutingCloudClient to route through a set of waypoints with the ThinkGeo Cloud",
        "source": "Samples/UsingCloudMapsServices/RoutingCloudServicesSample"
      },
      {
        "id": "ThinkGeo.UI.WinForms.HowDoI.RoutingServiceAreaCloudServicesSample",
        "title": "Routing - Service Area",
        "description": "Learn how to use the RoutingCloudClient to find the service area of a location with the ThinkGeo Cloud",
        "source": "Samples/UsingCloudMapsServices/RoutingServiceAreaCloudServicesSample"
      },
      {
        "id": "ThinkGeo.UI.WinForms.HowDoI.RoutingTSPCloudServicesSample",
        "title": "Routing - Traveling Sales Person",
        "description": "Learn how to use the RoutingCloudClient to find an optimized route through a set of waypoints with the ThinkGeo Cloud",
        "source": "Samples/UsingCloudMapsServices/RoutingTSPCloudServicesSample"
      },
      {
        "id": "ThinkGeo.UI.WinForms.HowDoI.ElevationCloudServicesSample",
        "title": "Elevation",
        "description": "Learn how to use the ElevationCloudClient class to get elevation data from the ThinkGeo Cloud",
        "source": "Samples/UsingCloudMapsServices/ElevationCloudServicesSample"
      },
      {
        "id": "ThinkGeo.UI.WinForms.HowDoI.GeocodingCloudServicesSample",
        "title": "Geocoding",
        "description": "Learn how to use the GeocodingCloudClient to access the Geocoding APIs available from the ThinkGeo Cloud",
        "source": "Samples/UsingCloudMapsServices/GeocodingCloudServicesSample"
      },
      {
        "id": "ThinkGeo.UI.WinForms.HowDoI.ReverseGeocodingCloudServicesSample",
        "title": "Reverse Geocoding",
        "description": "Learn how to use the ReverseGeocodingCloudClient to access the ReverseGeocoding APIs available from the ThinkGeo Cloud",
        "source": "Samples/UsingCloudMapsServices/ReverseGeocodingCloudServicesSample"
      },
      {
        "id": "ThinkGeo.UI.WinForms.HowDoI.ColorUtilitiesCloudServicesSample",
        "title": "Color Utilities",
        "description": "Learn how to use the ColorCloudClient class to access the ColorUtilities APIs available from the ThinkGeo Cloud",
        "source": "Samples/UsingCloudMapsServices/ColorUtilitiesCloudServicesSample"
      },
      {
        "id": "ThinkGeo.UI.WinForms.HowDoI.TimezoneCloudServicesSample",
        "title": "Timezone",
        "description": "Learn how to use the TimezoneCloudClient to access the Timezone APIs available from the ThinkGeo Cloud",
        "source": "Samples/UsingCloudMapsServices/TimezoneCloudServicesSample"
      },
      {
        "id": "ThinkGeo.UI.WinForms.HowDoI.ProjectionCloudServicesSample",
        "title": "Projection",
        "description": "Learn how to use the ProjectionCloudClient to access the Projection APIs available from the ThinkGeo Cloud",
        "source": "Samples/UsingCloudMapsServices/ProjectionCloudServicesSample"
      },
      {
        "id": "ThinkGeo.UI.WinForms.HowDoI.WorldMapsQueryCloudServicesSample",
        "title": "World Maps Query",
        "description": "Learn how to use the MapsQueryClient to query the WorldMaps dataset available from the ThinkGeo Cloud",
        "source": "Samples/UsingCloudMapsServices/WorldMapsQueryCloudServicesSample"
      }
    ]
  },
  {
    "title": "Extensibility",
    "children": [
      {
        "id": "ThinkGeo.UI.WinForms.HowDoI.ExtendingStylesSample",
        "title": "Extending Styles",
        "description": "Learn how to use the Style base class to create your own custom styles.",
        "source": "Samples/Extensibility/ExtendingStylesSample"
      },
      {
        "id": "ThinkGeo.UI.WinForms.HowDoI.ExtendingLayersSample",
        "title": "Extending Layers",
        "description": "Learn how to use the Layer base class to create your own custom layers.",
        "source": "Samples/Extensibility/ExtendingLayersSample"
      },
      {
        "id": "ThinkGeo.UI.WinForms.HowDoI.ExtendingFeatureSourcesSample",
        "title": "Extending Feature Sources",
        "description": "Learn how to use the FeatureSource base class to create your own custom Feature Source.",
        "source": "Samples/Extensibility/ExtendingFeatureSourcesSample"
      }

    ]
  },
  {
    "title": "Interpolation",
    "children": [
      {
        "id": "ThinkGeo.UI.WinForms.HowDoI.Placeholder",
        "title": "Interpolation Methods (TODO)",
        "description": "Learn how to do grid based interpolation using various methods",
        "source": "Samples/Interpolation/Placeholder"
      }
    ]
  }
]