module manson-wedding

go 1.20

require (
	github.com/joho/godotenv v1.5.1
	github.com/julienschmidt/httprouter v1.3.0
	golang.org/x/oauth2 v0.6.0
)

require (
	cloud.google.com/go/compute v1.18.0 // indirect
	github.com/googleapis/enterprise-certificate-proxy v0.2.3 // indirect
	golang.org/x/sys v0.6.0 // indirect
	golang.org/x/text v0.8.0 // indirect
	google.golang.org/genproto v0.0.0-20230306155012-7f2fa6fef1f4 // indirect
	google.golang.org/grpc v1.53.0 // indirect
)

require (
	cloud.google.com/go/compute/metadata v0.2.3 // indirect
	github.com/golang/protobuf v1.5.2 // indirect
	golang.org/x/net v0.8.0 // indirect
	google.golang.org/api v0.114.0
	google.golang.org/appengine v1.6.7 // indirect
	google.golang.org/protobuf v1.29.1 // indirect
)
