[
  {
      "id": 1,
      "title": "Job to Insert fro EAS",
      "primary_skill": "Java",
      "secondary_skill": "React JS",
      "domain": "Telecom",
      "responsibility": "Java Architect",
      "experience": "3",
      "location": "Chennai",
      "jobcode": "JAVA_01"
  },
  {
      "id": 2,
      "title": "Java - Software Engineer/senior Software Engineer",
      "primary_skill": "Java",
      "secondary_skill": "React JS",
      "domain": "Telecom",
      "responsibility": "Programming & Design",
      "experience": "10",
      "location": "Chennai",
      "jobcode": "JAVA_02"
  },
  {
      "id": 3,
      "title": "Java - Software Engineer/senior Software Engineer",
      "primary_skill": ".Net",
      "secondary_skill": "React JS",
      "domain": "Telecom",
      "responsibility": "Programming & Design",
      "experience": "10",
      "location": "Bangalore",
      "jobcode": "Microsoft_01"
  },
  {
      "id": 4,
      "title": "Microsoft Architectr",
      "primary_skill": ".Net",
      "secondary_skill": "React JS",
      "domain": "Telecom",
      "responsibility": "Programming & Design",
      "experience": "10",
      "location": "Pune",
      "jobcode": "Microsoft_02"
  }
]